{"text_format":"1","workbook":"xlsx","n_sheets":8,"sheets":["INSERIMENTO","SVILUPPO","STIPENDIO","CCNL 2019-2021","IND. INT. SPEC.","IND. AMM.NE","VACANZA CONTR.LE","RIFERIMENTI"],"not_rendered":{"charts":0,"images":9,"macros":1,"external_links":0,"defined_names":15,"comments":1,"pivot_tables":0},"unopened":[],"bounds":{"document_bytes":16777216,"sheet_cells":100000,"rows_first":2000,"rows_last":500,"rows_between":2000,"halvings":0,"cell_chars":16384,"cell_head_chars":4096},"cells_cut":0,"cells_raw":0,"read":"whole","date_system":"1900"}

{"sheet":"INSERIMENTO","index":0,"n_rows":34,"n_cols":23,"rows_kept":34,"cut":false,"hidden":false,"merged":[[5,21,5,22],[23,4,23,5],[25,4,25,5],[6,9,6,11],[6,12,6,14],[15,4,15,5],[17,4,17,5],[19,4,19,5],[21,4,21,5],[20,6,20,7],[11,13,11,14],[12,9,12,12],[9,6,9,7],[12,2,12,7],[8,12,8,14],[6,2,6,3],[26,2,26,3],[26,6,26,7],[15,9,15,11],[16,9,16,10],[18,9,18,10],[20,9,20,10],[22,9,22,10],[24,9,24,10],[26,9,26,10],[22,6,22,7],[23,6,23,7],[24,2,24,3],[24,6,24,7],[22,2,22,3],[21,6,21,7],[25,6,25,7],[20,2,20,3],[10,6,10,7],[15,6,15,7],[16,6,16,7],[17,6,17,7],[18,6,18,7],[19,6,19,7],[14,2,14,7],[2,2,3,14],[10,2,10,3],[16,2,16,3],[18,2,18,3],[14,9,14,14],[5,2,5,5],[8,9,8,11],[12,13,12,14],[8,2,8,5],[8,6,8,7],[10,9,10,11],[10,12,10,14],[9,9,9,11],[9,4,9,5],[6,4,6,7]]}
[null,null,null,null,null,null,null,null,null,null,null,null,null,null," "]
[]
[null,null,"MINISTERO DELLA DIFESA - DIREZIONE GENERALE PER IL PERSONALE CIVILE - III REPARTO - DIVISIONI 6^ E 7^"]
[]
[]
[null,null,"CELLE DI INSERIMENTO SEMPRE OBBLIGATORIO\nCELLE DI INSERIMENTO OBBLIGATORIO AL VERIFICARSI DELL'EVENTO\nCELLE DI INSERIMENTO FACOLTATIVO\n",null,null,null,null,null,null,null,null,null,null,null,null,null,null,null,null," ",null,"VERSIONE DEL 14.02.2024"]
[null,null,"NOMINATIVO:",null,"COLOMBO Cristoforo",null,null,null,{"$f":"IF(AND(G9>0,E7=\"\"),\"DATO OBBLIGATORIO\",\"\")","v":""},"CODICE FISCALE",null,null,null,null,null,null,null,null," "," "," "]
[]
{"$rows_left_out":27}
{"sheet":"SVILUPPO","index":1,"n_rows":82,"n_cols":76,"rows_kept":82,"cut":false,"hidden":false,"merged":[[1,2,2,16],[7,12,7,14],[14,20,14,29],[13,33,13,35],[13,36,13,48],[1,20,1,23],[13,2,13,4],[13,5,13,12],[5,2,5,3],[8,6,8,8],[9,2,9,3],[9,6,9,8],[7,10,7,11],[1,25,1,29],[11,6,11,8],[7,6,7,8],[11,10,11,13],[11,2,11,5],[7,2,7,5],[5,12,5,14],[9,10,9,11],[9,12,9,14],[5,4,5,8],[5,10,5,11]]}
[null,null,null,null,null,null,null,null,null,null,null,null,null,null,null," "]
[null,null,"MINISTERO DELLA DIFESA - DIREZIONE GENERALE PER IL PERSONALE CIVILE - III REPARTO - DIVISIONI 6^ E 7^",null,null,null,null,null,null,null,null,null,null,null,null,null,null,null,null,null,"EVENTUALI CONSEGUIMENTI DI PROGRESSIONI ECONOMICHE",null,null,null,null,"EVENTUALI PERIODI DI COMANDO PRESSO ALTRE AMMINISTRAZIONI"]
[null,null,null,null,null,null,null,null,null,null,null,null,null,null,null,null,null,null,null,null,null,null,null,"GG/MM/AAAA",null,null,null,"GG/MM/AAAA",null,"GG/MM/AAAA"]
[null,null,null,null,null,null,null,null,null,null,null,null,null,null,null,null,null,null,null,null,"2^ AREA/FASCIA CONSEGUITA:",{"$f":"IF(RIFERIMENTI!Q7=1,\"ERRORE\",IF(INSERIMENTO!E17=\"\",\"\",INSERIMENTO!E17))","v":"A3F2 (C1S)"},"DAL:",{"$f":"IF(RIFERIMENTI!Q13=1,\"ERRORE\",IF(INSERIMENTO!G17=\"\",\"\",INSERIMENTO!G17))","v":"2016-01-01"},null,{"$f":"IF(INSERIMENTO!J17=\"\",\"\",INSERIMENTO!J17)","v":"TRANSIZIONE ECOLOGICA"},"DAL:",{"$f":"IF(RIFERIMENTI!Q19=1,\"ERRORE\",IF(INSERIMENTO!M17=\"\",\"\",INSERIMENTO!M17))","v":"2009-05-05"},"AL:",{"$f":"IF(RIFERIMENTI!Q25=1,\"ERRORE\",IF(INSERIMENTO!O17=\"\",\"\",INSERIMENTO!O17))","v":"2013-05-04"}]
[null,null,null,null,null,null,null,null,null,null,null,null,null,null,null,null,null,null,null,null,null,null,null,"GG/MM/AAAA",null,null,null,"GG/MM/AAAA",null,"GG/MM/AAAA"]
[null,null,"NOMINATIVO:",null,{"$f":"IF(RIFERIMENTI!Q2=1,\"ERRORE\",IF(INSERIMENTO!E7=\"\",\"\",INSERIMENTO!E7))","v":"COLOMBO Cristoforo"},null,null,null,null,null,"CODICE FISCALE",null,{"$f":"IF(INSERIMENTO!M7=\"\",\"\",INSERIMENTO!M7)","v":""},null,null,null,null,null,null,null,"3^ AREA/FASCIA CONSEGUITA:",{"$f":"IF(RIFERIMENTI!Q8=1,\"ERRORE\",IF(INSERIMENTO!E19=\"\",\"\",INSERIMENTO!E19))","v":"A3F3 (C2)"},"DAL:",{"$f":"IF(RIFERIMENTI!Q14=1,\"ERRORE\",IF(INSERIMENTO!G19=\"\",\"\",INSERIMENTO!G19))","v":"2021-01-01"},null,{"$f":"IF(INSERIMENTO!J19=\"\",\"\",INSERIMENTO!J19)","v":""},"DAL:",{"$f":"IF(RIFERIMENTI!Q20=1,\"ERRORE\",IF(INSERIMENTO!M19=\"\",\"\",INSERIMENTO!M19))","v":""},"AL:",{"$f":"IF(RIFERIMENTI!Q26=1,\"ERRORE\",IF(INSERIMENTO!O19=\"\",\"\",INSERIMENTO!O19))","v":""},null,null,null,null,null,null,null,null,null,null,null,null,null,null,null,null,null,null,null,null,null,null,null," "]
[null,null,null,null,null,null,null,null,null,null,null,null,null,null,null,null,null,null,null,null,null,null,null,"GG/MM/AAAA",null,null,null,"GG/MM/AAAA",null,"GG/MM/AAAA"]
[null,null,"ASSEGNO PERSONALE RIASSORBIBILE ANNUO INIZIALE:",null,null,null,{"$f":"IF(RIFERIMENTI!Q3=1,\"ERRORE\",IF(INSERIMENTO!G9=\"\",0,INSERIMENTO!G9))","v":10650},null,null,null,"ENTE DI SERVIZIO:",null,{"$f":"IF(INSERIMENTO!M9=\"\",\"\",INSERIMENTO!M9)","v":"NAVARM (UFF/MAND: 122) "},null,null,null,null,null,null,null,"4^ AREA/FASCIA CONSEGUITA:",{"$f":"IF(RIFERIMENTI!Q9=1,\"ERRORE\",IF(INSERIMENTO!E21=\"\",\"\",INSERIMENTO!E21))","v":""},"DAL:",{"$f":"IF(RIFERIMENTI!Q15=1,\"ERRORE\",IF(INSERIMENTO!G21=\"\",\"\",INSERIMENTO!G21))","v":""},null,{"$f":"IF(INSERIMENTO!J21=\"\",\"\",INSERIMENTO!J21)","v":""},"DAL:",{"$f":"IF(RIFERIMENTI!Q21=1,\"ERRORE\",IF(INSERIMENTO!M21=\"\",\"\",INSERIMENTO!M21))","v":""},"AL:",{"$f":"IF(RIFERIMENTI!Q27=1,\"ERRORE\",IF(INSERIMENTO!O21=\"\",\"\",INSERIMENTO!O21))","v":""},null,null,null,null,null," "]
{"$rows_left_out":75}
{"sheet":"STIPENDIO","index":2,"n_rows":391,"n_cols":42,"rows_kept":391,"cut":false,"hidden":true,"merged":[[281,13,281,14],[281,15,281,16],[279,13,279,14],[276,13,276,14],[277,13,277,14],[278,13,278,14],[279,15,279,16],[280,13,280,14],[280,15,280,16],[23,24,23,29],[1,3,1,8],[4,13,4,14],[2,15,2,19],[225,12,225,13],[225,14,225,15],[2,20,2,41],[24,26,24,29],[23,34,23,36],[25,31,26,31],[25,32,26,32],[24,36,26,36],[23,31,24,33],[25,33,26,33],[24,34,25,34],[24,35,25,35],[226,12,226,13],[227,12,227,13],[228,12,228,13],[229,12,229,13],[230,12,230,13],[237,12,237,13],[238,12,238,13],[232,14,232,15],[233,14,233,15],[234,14,234,15],[235,14,235,15],[236,14,236,15],[237,14,237,15],[238,14,238,15],[232,12,232,13],[233,12,233,13],[234,12,234,13],[235,12,235,13],[236,12,236,13],[227,14,227,15],[228,14,228,15],[229,14,229,15],[230,14,230,15],[231,12,231,13],[231,14,231,15],[282,15,282,16],[283,15,283,16],[282,13,282,14],[283,13,283,14],[269,13,269,14],[271,13,271,14],[271,15,271,16],[272,13,272,14],[272,15,272,16],[274,13,274,14],[274,15,274,16],[275,13,275,14],[275,15,275,16],[276,15,276,16],[277,15,277,16],[278,15,278,16],[226,14,226,15],[290,12,290,16],[314,12,314,17],[270,13,270,14],[270,15,270,16],[273,13,273,14],[273,15,273,16],[265,15,265,16],[266,15,266,16],[267,15,267,16],[268,15,268,16],[269,15,269,16],[265,13,265,14],[266,13,266,14],[267,13,267,14],[268,13,268,14]]}
[]
[null,null,null,"STIPENDIO SENZA I.I.S."]
[null,null,null,"DAL","AL","POS. ECON.","FASCE NELLE AREE","ANNUO LORDO","MENSILE LORDO",null,null,null,null,null,null,"£IRE",null,null,null,null,"€uro"]
[null,null,null,"A1","A1F1"]
[null,{"$f":"CONCATENATE(G5,\" (\",F5,\") \",D5)","v":"A1F1 (A1) 35977"},null,"1998-07-01","1998-10-31","A1","A1F1",{"$f":"ROUND(K5/1936.27,2)","v":5925.31},{"$f":"ROUND(H5/12,2)","v":493.78},null,11473000,null,null,"DAL ",null,"1998-07-01","1998-11-01","1999-06-01","2000-07-01","2001-01-01","2002-01-01","2003-01-01","2004-01-01","2005-02-01","2015-12-31","2006-01-01","2007-01-01","2007-02-01","2007-12-31","2008-01-01","2009-01-01","2010-04-01","2010-07-01","2016-01-01","2017-01-01","2018-03-01","2018-04-01","2019-01-01","2020-01-01","2021-01-01","2022-07-01","2022-10-01"]
[null,{"$f":"CONCATENATE(G6,\" (\",F6,\") \",D6)","v":"A1F1 (A1) 36100"},null,"1998-11-01","1999-05-31","A1","A1F1",{"$f":"ROUND(K6/1936.27,2)","v":6142.22},{"$f":"ROUND(H6/12,2)","v":511.85},null,11893000]
[null,"A1F1 (A1) 36312",null,"1999-06-01","2000-06-30","A1","A1F1",6321.95,526.83000000000004,null,12241000,null,null,"A1","A1 F1",11473000,11893000,12241000,12601000,13213000,7194.75,13843.31,14229.09,14727.59,14768.65,14850.61,15189.01,15682.93,15682.93,15770.65,16384.57,16384.57,16384.57,16460.169999999998,16614.97,17140.57,17263.45,17417.05,17574.25,18019.45,18243.61,18255.88]
[null,"A1F1 (A1) 36708",null,"2000-07-01","2000-12-31","A1","A1F1",6507.87,542.32000000000005,null,12601000,null,null,"A1S","A1F2",12500000,12920000,13268000,13628000,14240000,7725.15,14373.71,14759.49,15257.99,"15.299.05",15384.01,15734.53,16246.21,16246.21,16337.05,16973.05,16973.05,16973.05,17052.25,17211.849999999999,17741.05,17868.349999999999,18026.75,18189.95,18636.349999999999,18864.71,18876.98]
{"$rows_left_out":384}
{"sheet":"CCNL 2019-2021","index":3,"n_rows":130,"n_cols":36,"rows_kept":130,"cut":false,"hidden":true,"merged":[[45,28,45,29],[46,28,46,29],[40,28,40,29],[41,28,41,29],[42,28,42,29],[43,28,43,29],[44,28,44,29],[35,28,35,29],[36,28,36,29],[37,28,37,29],[38,28,38,29],[39,28,39,29],[30,28,30,29],[31,28,31,29],[32,28,32,29],[33,28,33,29],[34,28,34,29],[28,1,30,1],[96,2,96,7],[97,2,97,7],[77,2,77,7],[52,24,54,24],[28,11,29,17],[52,21,54,23],[52,2,53,2],[52,4,54,4],[52,5,52,9],[76,2,76,7],[28,4,28,6],[28,7,28,9],[52,1,54,1],[52,11,53,19],[28,2,30,2],[20,30,24,35],[0,1,0,9],[1,1,3,1],[1,4,3,4],[1,5,1,9],[1,2,2,2],[1,30,2,35],[1,24,2,28],[3,11,3,13],[7,20,9,22],[1,11,1,18],[1,20,2,22]]}
[null,"IMPORTI ESPRESSI IN €URO "]
[null,"POSIZIONE ECONOMICA","RETRIBUZIONE TABELLARE ANNUA C.C.N.L.  2016/2018",null,"POSIZIONE ECONOMICA","RETRIBUZIONE TABELLARE ANNUA CCNL 2019/2021 ",null,null,null,null,null,"STIPENDIO ANNUO LORDO RAP\nCCNL 2019 - 2021",null,null,null,null,null,null,null,null,"Ulteriori incrementi mensili\ndella retribuzione tabellare.\nValori da corrispondere per 13 mensilità.\n\n\n",null,null,null,"ELEMENTO PEREQUATIVO dal 1°.03.2018 al 30.06.2022",null,null,null,null,null,"STIPENDIO ANNUO LORDO RAP - CCNL 2019 - 2021\ncon conglobamento Elemento Perequativo"]
[null,null,null,null,null,"TABELLA B1","TABELLA B1","TABELLA B1","TABELLA C1","TABELLA F"]
[null,null,"FINO AL 31/12/2018",null,null,"DAL\n1° GENNAIO 2019","DAL\n1° GENNAIO 2020","DAL\n1° GENNAIO 2021","DAL\n1° LUGLIO 2022","DAL\n1° NOVEMBRE 2022",null,null,null,null,"01.01.2019","01.01.2020","01.01.2021","01.07.2022","01.11.2022",null,"Ministeri",null,"Incrementi (1)\n€",null,null,null,null,"mensile x 12 mesi\n(no 13^)","annuo x 12 mesi\n(no 13^)",null,null,null,null,"01.01.2021","ELEMENTO PEREQUATIVO\ndal 01.01.2019 (1)","01.07.2022"]
[null,"A3F7",32246.48,null,"A3F7",{"$f":"O5","v":32533.279999999999},{"$f":"P5","v":32827.279999999999},{"$f":"Q5","v":33614.480000000003},{"$f":"R5","v":33614.480000000003},{"$f":"S5","v":23501.879999999997},null,"III","F",7,32533.279999999999,32827.279999999999,33614.480000000003,{"$f":"Q5+AI5","v":33614.480000000003},23501.879999999997,null,"Area","III",16.850000000000001,null,null,null,null,null,null,null,"III","F",7,33614.480000000003,0,33614.480000000003]
[null,"A3F6",30369,null,"A3F6",{"$f":"O6","v":30639},30916.2,31641,31641,23501.879999999997,null,"III","F",6,30639,30916.2,31641,{"$f":"Q6+AI6","v":31641},23501.879999999997,null,"Area","II",12.5,null,null,null,null,null,null,null,"III","F",6,31641,0,31641]
[null,"A3F5",28449.67,null,"A3F5",28702.87,28962.07,29655.67,29655.67,23501.879999999997,null,"III","F",5,28702.87,28962.07,29655.67,29655.67,23501.879999999997,null,"Area","I",12.27,null,null,null,null,null,null,null,"III","F",5,29655.67,0,29655.67]
[null,"A3F4",26718.84,null,"A3F4",26956.44,27200.04,27858.84,27858.84,23501.879999999997,null,"III","F",4,26956.44,27200.04,27858.84,27858.84,23501.879999999997,null,"(1) Decorrenti dalla data di applicazione del nuovo sistema di classificazione\nprofessionale",null,null,null,null,null,null,null,null,null,"III","F",4,27858.84,0,27858.84]
{"$rows_left_out":123}
{"sheet":"IND. INT. SPEC.","index":4,"n_rows":61,"n_cols":22,"rows_kept":61,"cut":false,"hidden":true,"merged":[[1,1,3,1],[7,12,13,12],[14,12,19,12],[20,12,22,12],[41,3,42,5],[41,6,41,8],[42,6,43,6],[42,7,43,7],[42,8,44,8],[43,3,44,3],[43,4,44,4],[43,5,44,5],[1,3,1,8],[2,3,2,8]]}
[]
[null,"CCNL\nINTEGRATIVO\n16-05-2001",null,"IND. INT. SPEC."]
[null,null,null,"PER L E POSIZIONI \"SUPER\", STESSI IMPORTI DELLE POSIZIONI \"NORMALI\""]
[null,null,null,"DAL","AL","POS. ECON.","FASCE NELLE AREE","ANNUO LORDO","MENSILE LORDO"]
[null,null,null,"A","A1",null,null,null,null,null,null,null,"TABELLA \"A\""]
[null,{"$f":"CONCATENATE(G6,\" (\",F6,\") \",D6)","v":"A1F1 (A1) 33543"},null,"1991-11-01","2022-10-31","A1","A1F1",{"$f":"ROUND(ROUND(VLOOKUP(G6,$O$8:$P$35,2,FALSE)/1936.27,2)/13*12,2)","v":6235.76},{"$f":"ROUND(H6/12,2)","v":519.65},null,null,null,"INDENNITA' INTEGRATIVA SPECIALE *",null,null,null,null,null,null,null,{"$f":"ROUND(VLOOKUP(G6,$O$8:$P$35,2,FALSE)/1936.27/13*12,2)","v":6235.76},{"$f":"EXACT(U6,H6)","v":true}]
[null,{"$f":"CONCATENATE(G7,\" (\",F7,\") \",D7)","v":"A1F1 (A1) 44866"},null,"2022-11-01","9999-01-01",{"$f":"F6","v":"A1"},{"$f":"G6","v":"A1F1"},{"$f":"VLOOKUP(G7,$F$46:$H$61,3,FALSE)","v":6235.8},{"$f":"ROUND(H7/12,2)","v":519.65}]
[null,{"$f":"CONCATENATE(G8,\" (\",F8,\") \",D8)","v":"A1F2 (A1S) 33543"},null,"1991-11-01","2022-10-31","A1S","A1F2",{"$f":"ROUND(ROUND(VLOOKUP(G8,$O$8:$P$35,2,FALSE)/1936.27,2)/13*12,2)","v":6235.76},{"$f":"ROUND(H8/12,2)","v":519.65},null,null,null,"C",null,"A3F7",{"$f":"P9","v":13931229},null,null,null,null,{"$f":"ROUND(VLOOKUP(G8,$O$8:$P$35,2,FALSE)/1936.27/13*12,2)","v":6235.76},{"$f":"EXACT(U8,H8)","v":true}]
{"$rows_left_out":54}
{"sheet":"IND. AMM.NE","index":5,"n_rows":336,"n_cols":82,"rows_kept":336,"cut":false,"hidden":true,"merged":[[1,4,1,10],[2,4,2,6],[285,21,287,21],[286,24,286,25],[285,22,286,22],[285,23,286,23],[334,2,334,9],[285,24,285,25],[287,22,287,25],[288,21,289,21],[323,2,323,6],[324,2,324,6],[325,2,325,6],[309,2,309,9],[333,2,333,9],[326,2,326,6],[327,2,327,6],[310,7,310,9],[328,2,328,6],[330,2,330,6],[331,2,331,6],[309,0,311,1],[332,0,335,1],[310,2,311,6],[312,2,312,6],[313,2,313,6],[314,2,314,6],[315,2,315,6],[316,2,316,6],[317,2,317,6],[318,2,318,6],[319,2,319,6],[320,2,320,6],[321,2,321,6],[322,2,322,6],[335,2,335,9],[332,2,332,9]]}
[]
[null,null,null,null,"IND. AMM.NE ",null,null,null,null,null,null,"Importi\nNoiPA",null,"Importi Calcolati",null,null,null,null,null,null,null,"ELENCO DINAMICO: ALTRE_AMM.NI",null,null,null,null,null,null,null,"ELENCO DINAMICO: ALTRE_AMM.NI_2",null,null,null,null,null,null,"ELENCO DINAMICO: ALTRE_AMM.NI_3",null,null,null,null,null,null,"ELENCO DINAMICO: ALTRE_AMM.NI_4",null,null,null,null,null,null,"ELENCO DINAMICO: ALTRE_AMM.NI_5",null,null,null,null,null,null,"ELENCO DINAMICO: ALTRE_AMM.NI_6"]
[null,null,null,null,"PER L E POSIZIONI \"SUPER\", STESSI IMPORTI DELLE POSIZIONI \"NORMALI\"",null,null,null,"BASE","OP.VA","IND.LE","BASE",null,"BASE",null,null,null,null,null,null,"SIGLA","AMMINISTRAZIONI",null,null,null,null,null,"SIGLA",null,"AMMINISTRAZIONI",null,null,null,null,null,null,"AMMINISTRAZIONI",null,null,null,null,null,null,"AMMINISTRAZIONI",null,null,null,null,null,null,"AMMINISTRAZIONI",null,null,null,null,null,null,"AMMINISTRAZIONI"]
[null,null,null,null,"DAL","AL","POS. ECON.","FASCE NELLE AREE","MENSILE LORDO","MENSILE LORDO","MENSILE LORDO","ANNUO LORDO",null,"MENSILE LORDO","ANNUO LORDO",null,null,null,null,null,"MAE","AFFARI ESTERI E COOPERAZIONE INTERNAZIONALE",null,null,null,null,null,"MAE",null,{"$f":"IF(INSERIMENTO!$J$17>0,V4,\"\")","v":"AFFARI ESTERI E COOPERAZIONE INTERNAZIONALE"},null,null,null,null,null,null,{"$f":"IF(INSERIMENTO!$J$19>0,AD4,\"\")","v":""},null,null,null,null,null,null,{"$f":"IF(INSERIMENTO!$J$21>0,AK4,\"\")","v":""},null,null,null,null,null,null,{"$f":"IF(INSERIMENTO!$J$23>0,AR4,\"\")","v":""},null,null,null,null,null,null,{"$f":"IF(INSERIMENTO!$J$25>0,AY4,\"\")","v":""}]
[null,null,null,null,"A1","A1F1",null,null,null,null,null,null,null,null,null,null,null,null,null,null,"AVV","AVVOCATURA",null,null,null,null,null,"AVV",null,{"$f":"IF(INSERIMENTO!$J$17>0,V5,\"\")","v":"AVVOCATURA"},null,null,null,null,null,null,{"$f":"IF(INSERIMENTO!$J$19>0,AD5,\"\")","v":""},null,null,null,null,null,null,{"$f":"IF(INSERIMENTO!$J$21>0,AK5,\"\")","v":""},null,null,null,null,null,null,{"$f":"IF(INSERIMENTO!$J$23>0,AR5,\"\")","v":""},null,null,null,null,null,null,{"$f":"IF(INSERIMENTO!$J$25>0,AY5,\"\")","v":""}]
[null,{"$f":"CONCATENATE(H6,\" \",E6)","v":"A1F1 34700"},{"$f":"CONCATENATE(H6,\" (\",G6,\") \",E6)","v":"A1F1 (A1) 34700"},null,"1995-01-01","1997-06-30","A1","A1F1",83.15,88.31,90.9,{"$f":"ROUND(I6*12,2)","v":997.8},null,null,{"$f":"ROUND(I6*12,2)","v":997.8},null,null,null,null,null,"CDS","CONSIGLIO DI STATO",null,null,null,null,null,"CDS",null,{"$f":"IF(INSERIMENTO!$J$17>0,V6,\"\")","v":"CONSIGLIO DI STATO"},null,null,null,null,null,null,{"$f":"IF(INSERIMENTO!$J$19>0,AD6,\"\")","v":""},null,null,null,null,null,null,{"$f":"IF(INSERIMENTO!$J$21>0,AK6,\"\")","v":""},null,null,null,null,null,null,{"$f":"IF(INSERIMENTO!$J$23>0,AR6,\"\")","v":""},null,null,null,null,null,null,{"$f":"IF(INSERIMENTO!$J$25>0,AY6,\"\")","v":""}]
[null,{"$f":"CONCATENATE(H7,\" \",E7)","v":"A1F1 35612"},"A1F1 (A1) 35612",null,"1997-07-01","1999-12-31","A1","A1F1",107.42,112.58,115.17,{"$f":"ROUND(I7*12,2)","v":1289.04},null,null,1289.04,null,null,null,null,null,"CDC","CORTE DEI CONTI",null,null,null,null,null,"CDC",null,{"$f":"IF(INSERIMENTO!$J$17>0,V7,\"\")","v":"CORTE DEI CONTI"},null,null,null,null,null,null,{"$f":"IF(INSERIMENTO!$J$19>0,AD7,\"\")","v":""},null,null,null,null,null,null,{"$f":"IF(INSERIMENTO!$J$21>0,AK7,\"\")","v":""},null,null,null,null,null,null,{"$f":"IF(INSERIMENTO!$J$23>0,AR7,\"\")","v":""},null,null,null,null,null,null,{"$f":"IF(INSERIMENTO!$J$25>0,AY7,\"\")","v":""}]
[null,"A1F1 36526","A1F1 (A1) 36526",null,"2000-01-01","2000-06-30","A1","A1F1",114.65,119.81,122.4,1375.8,null,null,1375.8,null,null,null,null,null,"CUL","CULTURA",null,null,null,null,null,"CUL",null,{"$f":"IF(INSERIMENTO!$J$17>0,V8,\"\")","v":"CULTURA"},null,null,null,null,null,null,{"$f":"IF(INSERIMENTO!$J$19>0,AD8,\"\")","v":""},null,null,null,null,null,null,{"$f":"IF(INSERIMENTO!$J$21>0,AK8,\"\")","v":""},null,null,null,null,null,null,{"$f":"IF(INSERIMENTO!$J$23>0,AR8,\"\")","v":""},null,null,null,null,null,null,{"$f":"IF(INSERIMENTO!$J$25>0,AY8,\"\")","v":""}]
{"$rows_left_out":329}
{"sheet":"VACANZA CONTR.LE","index":6,"n_rows":300,"n_cols":28,"rows_kept":300,"cut":false,"hidden":true,"merged":[[1,24,1,27],[2,19,2,21],[206,11,207,13],[96,11,97,13],[118,11,119,13],[140,11,141,13],[151,11,152,13],[162,11,163,13],[184,11,185,13],[1,3,1,8],[19,11,20,13],[41,11,42,13],[52,11,53,13],[74,11,75,13],[228,11,229,13],[250,11,251,13],[272,11,273,13],[283,11,284,13],[294,11,295,13]]}
[]
[null,null,null,"VACANZA CONTRATTUALE",null,null,null,null,null,null,null,null,null,null,null,null,null,null,null,null,null,null,null,null,"IMPORTI MENSILI ESPRESSI IN €URO (LORDO CONTRIBUTIVO/PREVIDENZIALE)"]
[null,null,null,"DAL","AL","POS. ECON.","FASCE NELLE AREE","ANNUO LORDO","MENSILE LORDO","ANNUO LORDO","MENSILE LORDO",null,null,null,null,"IVC dal 1° luglio 2010",null,null,null,"TABELLA C",null,null,null,null,"AREA","FASCIA"," DAL 1° APRILE 2019 AL 30 GIUGNO 2019"," DAL 1° LUGLIO 2019 FINO AL RINNOVO CINTRATTUALE"]
[null,null,null,"A1","A1F1",null,null,null,null,null,null,null,null,null,"A3F7",229.86,null,null,null,"Indennità di vacanza contrattuale biennio 2010-11",null,null,null,null,"I","F1",6.04,10.07]
[null,{"$f":"CONCATENATE(G5,\" (\",F5,\") \",D5)","v":"A1F1 (A1) 35977"},null,"1998-07-01","1998-10-31","A1","A1F1",0,0,{"$f":"H5","v":0},{"$f":"J5","v":0},null,null,null,"A3F6",216.6,null,null,null,"Incrementi mensili della retribuzione tabellare",null,null,null,null,"I","F2",6.25,10.42]
[null,"A1F1 (A1) 36100",null,"1998-11-01","1999-05-31","A1","A1F1",0,0,{"$f":"H6","v":0},{"$f":"J6","v":0},null,null,null,"A3F5",202.81,null,null,null,"Valori in Euro da corrispondere per 13 mensilità",null,null,null,null,"I","F3",6.48,10.81]
[null,"A1F1 (A1) 36312",null,"1999-06-01","2000-06-30","A1","A1F1",0,0,0,0,null,null,null,"A3F4",190.41,null,null,null,null,null,null,null,null,"II","F1",6.37,10.62]
[null,"A1F1 (A1) 36708",null,"2000-07-01","2000-12-31","A1","A1F1",0,0,0,0,null,null,null,"A3F3",173.34,null,null,null,"Posizione economica","Dal 1.4.2010","Rideterminato dal 1.7.2010 (1)",null,null,"II","F2",6.7,11.16]
{"$rows_left_out":293}
{"sheet":"RIFERIMENTI","index":7,"n_rows":83,"n_cols":40,"rows_kept":83,"cut":false,"hidden":true,"merged":[]}
[{"$f":"CONCATENATE(C1,\" \",D1)","v":"ENTE UFF/MAND"}," ","ENTE","UFF/MAND",null,"ASSUNZIONE/IND. AMM.NE",null,0,"??","??",null,null,null,"RICERCA\nI.A. COM.",null,null,"CONTROLLO ERRORI SCHEDA \"CALCOLO\"",null,null,null,"COMPETENZA","SCADENZE","A/F","DECORRENZE","DATE DOPPIE","CONTA DOPPIE","SELEZIONE 1","RANGO 1","SELEZIONE 1 BIS","ORDINE 1 ","RISULTATO 1","RANGO 2","RISULTATO 1 BIS","ORDINE 2","RISULTATO 2","DAL","AL"]
[{"$f":"CONCATENATE(UPPER(C2),\" (\",$D$1,\": \",D2,\") \")","v":"AGENZIA INDUSTRIE DIFESA (UFF/MAND: 581/504) "},null,"Agenzia Industrie Difesa","581/504",null,{"$f":"IF(INSERIMENTO!G11<DATE(2009,1,1),DATE(2009,1,1),INSERIMENTO!G11)","v":"2009-01-01"},null,{"$f":"IF(K2=\"\",I2,CONCATENATE(I2,\" (\",K2,\")\"))","v":"A1F1 (A1)"},"A1F1",{"$f":"H3","v":"A1F2 (A1S)"},"A1","A1F1","1998-07-01",24,null,null,{"$f":"IF(INSERIMENTO!I7=\"DATO OBBLIGATORIO\",1,0)","v":0},"I7",null,null,"STIP.",null,null,"1998-07-01",{"$f":"COUNTIF($X$2:$X$67,X2)","v":1},{"$f":"COUNTIF($X$2:X2,X2)","v":1},{"$f":"IF(X2<$X$49,DATE(9999,12,31),IF(X2>$X$68,DATE(9999,12,31),IF(Z2>1,DATE(9999,12,31),X2)))","v":"9999-12-31"},{"$f":"RANK(AA2,$AA$2:$AA$67,1)","v":26},{"$f":"AA2","v":"9999-12-31"},1,{"$f":"IF(ISNA(VLOOKUP(AD2,$AB$2:$AC$67,2,FALSE)),DATE(9999,12,31),VLOOKUP(AD2,$AB$2:$AC$67,2,FALSE))","v":"2003-04-01"},{"$f":"RANK(AE2,$AE$2:$AE$67,1)","v":1},{"$f":"AE2","v":"2003-04-01"},1,{"$f":"IF(ISNA(VLOOKUP(AH2,$AF$2:$AG$67,2,FALSE)),DATE(9999,12,31),VLOOKUP(AH2,$AF$2:$AG$67,2,FALSE))","v":"2003-04-01"},{"$f":"IF(AI2=DATE(9999,12,31),\"\",AI2)","v":"2003-04-01"},{"$f":"IF(AI2=DATE(9999,12,31),\"\",IF(AJ3=\"\",$AI$69,AJ3-1))","v":"2003-12-31"}]
[{"$f":"CONCATENATE(UPPER(C3),\" (\",$D$1,\": \",D3,\") \")","v":"ARMAEREO (UFF/MAND: 123) "},null,"Armaereo",123,null,"9999-12-31",null,"A1F2 (A1S)","A1F2",{"$f":"H4","v":"A1F3"},"A1S","A1F2","1998-07-01",23,null,null,{"$f":"IF(INSERIMENTO!I9=\"INSERIRE IMPORTO\",1,0)","v":0},"I9",null,null,"STIP.",null,null,"1998-11-01",1,{"$f":"COUNTIF($X$2:X3,X3)","v":1},"9999-12-31",26,{"$f":"AA3","v":"9999-12-31"},{"$f":"AD2+1","v":2},"2004-01-01",2,{"$f":"AE3","v":"2004-01-01"},{"$f":"AH2+1","v":2},"2004-01-01",{"$f":"IF(AI3=DATE(9999,12,31),\"\",AI3)","v":"2004-01-01"},"2005-01-31"]
["BILANDIFE (UFF/MAND: 135) ",null,"Bilandife",135,null,null,null,"A1F3","A1F3",null,null,null,"2007-12-31",22,null,null,{"$f":"IF(INSERIMENTO!E10=\"DATO OBBLIGATORIO\",1,IF(INSERIMENTO!E10=\"ERRORE\",1,0))","v":0},"E10",null,null,"STIP.",null,null,"1999-06-01",1,{"$f":"COUNTIF($X$2:X4,X4)","v":1},"9999-12-31",26,"9999-12-31",{"$f":"AD3+1","v":3},"2005-02-01",3,"2005-02-01",{"$f":"AH3+1","v":3},"2005-02-01","2005-02-01","2005-12-30"]
["CAPO CORPO GENIO A.M. (UFF/MAND: 84) ",null,"Capo Corpo Genio A.M.",84,null,null,null,"A2F1 (B1)","A2F1",{"$f":"H6","v":"A2F2 (B2)"},"B1","A2F1","1998-07-01",21,null,null,{"$f":"IF(INSERIMENTO!G10=\"DATA ?\",1,IF(INSERIMENTO!G10=\"ERRORE\",1,0))","v":0},"G10",null,null,"STIP.",null,null,"2000-07-01",2,{"$f":"COUNTIF($X$2:X5,X5)","v":1},"9999-12-31",26,"9999-12-31",4,"2005-12-31",4,"2005-12-31",4,"2005-12-31","2005-12-31","2005-12-31"]
["CASD (UFF/MAND: 44) ",null,"CASD",44,null,null,null,"A2F2 (B2)","A2F2",{"$f":"H7","v":"A2F3 (B3)"},"B2","A2F2","1998-07-01",20,null,null,{"$f":"IF(INSERIMENTO!N12=\"ERRORE\",1,0)","v":0},"N12",null,null,"STIP.",null,null,"2001-01-01",2,{"$f":"COUNTIF($X$2:X6,X6)","v":1},"9999-12-31",26,"9999-12-31",5,"2006-01-01",5,"2006-01-01",5,"2006-01-01","2006-01-01","2006-12-31"]
["CIRCOLO SOTTUFF. M.M. ROMA (UFF/MAND: 67) ",null,"Circolo Sottuff. M.M. Roma",67,null,null,null,"A2F3 (B3)","A2F3",{"$f":"H8","v":"A2F4 (B3S)"},"B3","A2F3","1998-07-01",19,null,null,{"$f":"IF(INSERIMENTO!E16=\"DATO OBBLIGATORIO\",1,IF(INSERIMENTO!E16=\"ERRORE\",1,0))","v":0},"E16",{"$f":"Q7","v":0},null,"STIP.",null,null,"2002-01-01",2,{"$f":"COUNTIF($X$2:X7,X7)","v":1},"9999-12-31",26,"9999-12-31",6,"2007-01-01",6,"2007-01-01",6,"2007-01-01","2007-01-01","2007-01-31"]
["CIRCOLO UFFIC.CAIO DUILIO M.M. (UFF/MAND: 64) ",null,"Circolo Uffic.Caio Duilio M.M.",64,null,null,null,"A2F4 (B3S)","A2F4",{"$f":"H9","v":"A2F5"},"B3S","A2F4","1998-07-01",18,null,null,{"$f":"IF(INSERIMENTO!E18=\"DATO OBBLIGATORIO\",1,IF(INSERIMENTO!E18=\"ERRORE\",1,0))","v":0},"E18",{"$f":"Q8","v":0},null,"STIP.",null,null,"2003-01-01",2,{"$f":"COUNTIF($X$2:X8,X8)","v":1},"9999-12-31",26,"9999-12-31",7,"2007-02-01",7,"2007-02-01",7,"2007-02-01","2007-02-01","2007-12-30"]
{"$rows_left_out":75}