{"text_format":"1","workbook":"xlsx","n_sheets":8,"sheets":["INSERIMENTO","SVILUPPO","STIPENDIO","CCNL 2019-2021","IND. INT. SPEC.","IND. AMM.NE","VACANZA CONTR.LE","RIFERIMENTI"],"not_rendered":{"charts":0,"images":9,"macros":1,"external_links":0,"defined_names":15,"comments":1,"pivot_tables":0},"unopened":[],"bounds":{"document_bytes":16777216,"sheet_cells":100000,"rows_first":2000,"rows_last":500,"rows_between":2000,"halvings":0,"cell_chars":16384,"cell_head_chars":4096},"cells_cut":0,"cells_raw":0,"read":"whole","date_system":"1900"}

{"sheet":"INSERIMENTO","index":0,"n_rows":34,"n_cols":23,"rows_kept":34,"cut":false,"hidden":false,"merged":[[5,21,5,22],[23,4,23,5],[25,4,25,5],[6,9,6,11],[6,12,6,14],[15,4,15,5],[17,4,17,5],[19,4,19,5],[21,4,21,5],[20,6,20,7],[11,13,11,14],[12,9,12,12],[9,6,9,7],[12,2,12,7],[8,12,8,14],[6,2,6,3],[26,2,26,3],[26,6,26,7],[15,9,15,11],[16,9,16,10],[18,9,18,10],[20,9,20,10],[22,9,22,10],[24,9,24,10],[26,9,26,10],[22,6,22,7],[23,6,23,7],[24,2,24,3],[24,6,24,7],[22,2,22,3],[21,6,21,7],[25,6,25,7],[20,2,20,3],[10,6,10,7],[15,6,15,7],[16,6,16,7],[17,6,17,7],[18,6,18,7],[19,6,19,7],[14,2,14,7],[2,2,3,14],[10,2,10,3],[16,2,16,3],[18,2,18,3],[14,9,14,14],[5,2,5,5],[8,9,8,11],[12,13,12,14],[8,2,8,5],[8,6,8,7],[10,9,10,11],[10,12,10,14],[9,9,9,11],[9,4,9,5],[6,4,6,7]]}
[null,null,null,null,null,null,null,null,null,null,null,null,null,null," "]
[]
[null,null,"MINISTERO DELLA DIFESA - DIREZIONE GENERALE PER IL PERSONALE CIVILE - III REPARTO - DIVISIONI 6^ E 7^"]
[]
[]
[null,null,"CELLE DI INSERIMENTO SEMPRE OBBLIGATORIO\nCELLE DI INSERIMENTO OBBLIGATORIO AL VERIFICARSI DELL'EVENTO\nCELLE DI INSERIMENTO FACOLTATIVO\n",null,null,null,null,null,null,null,null,null,null,null,null,null,null,null,null," ",null,"VERSIONE DEL 14.02.2024"]
[null,null,"NOMINATIVO:",null,"COLOMBO Cristoforo",null,null,null,{"$f":"IF(AND(G9>0,E7=\"\"),\"DATO OBBLIGATORIO\",\"\")","v":""},"CODICE FISCALE",null,null,null,null,null,null,null,null," "," "," "]
[]
[null,null,"ASSEGNO PERSONALE RIASSORBIBILE ANNUO INIZIALE:",null,null,null,10650,null,{"$f":"IF(AND(E7>0,G9=\"\"),\"INSERIRE IMPORTO\",\"\")","v":""},"ENTE DI SERVIZIO:",null,null,"NAVARM (UFF/MAND: 122) ",null,null,null,null,null," "]
[null,null,null,null,{"$f":"IF(AND(E11=\"\",G11>0),\"DATO OBBLIGATORIO\",\"\")","v":""},null,{"$f":"IF(AND(E11>0,G11=\"\"),\"DATA ?\",IF(DATE(YEAR(G11),MONTH(G11),DAY(G11))<DATE(YEAR(T11),MONTH(T11),DAY(T11)),\"ERRORE\",\"GG/MM/AAAA\"))","v":"GG/MM/AAAA"},null,null,null,null,null,null,null,null,null,null,null," ",null,null,null," "]
[null,null,"AREA/FASCIA INIZIALE:",null,"A3F1 (C1)","DAL:","2003-04-01",null,null,"EVENTUALE R.I.A. ANNUA:",null,null,null,null,null,null,null,null,null,{"$f":"VLOOKUP(E11,RIFERIMENTI!$H$1:$M$17,6,FALSE)","v":"1998-07-01"}]
[null,null,null,null,null,null,null,null,null,null,null,{"$f":"IF(I11=\"ASS. RIASS. PARAMETRATO AI TABELLARI PREVIGENTI AL CCNL 2016-2018:\",\"SI/NO\",\"\")","v":""},null,{"$f":"IF(N13=\"\",\"GG/MM/AAAA\",IF(N13<R13,\"ERRORE\",\"GG/MM/AAAA\"))","v":"GG/MM/AAAA"},null,null,null,"MAX"]
[null,null,"SE, SULLO SCHERMO DEL TUO PC, IL PROSPETTO È TROPPO GRANDE O PICCOLO, VAI SULLA BARRA MULTIFUNZIONE, CLICCA SU \"VISUALIZZA - ZOOM\" E SCEGLI LA \"%\" DI VISUALIZZAZIONE \n",null,null,null,null,null,null,"EVENTUALE ULTIMO GIORNO DI SERVIZIO :",null,null,null,null,null,null,null,{"$f":"RIFERIMENTI!V69","v":"2021-01-01"},null,{"$f":"IF(N13>0,N13,DATE(9999,12,31))","v":"9999-12-31"}," "]
[null,null,null,null,null,null,null,null,null,null,null,null,null,null,null,null,null,null," "]
[null,null,"EVENTUALI CONSEGUIMENTI DI PROGRESSIONI ECONOMICHE",null,null,null,null,null,null,"EVENTUALI PERIODI DI COMANDO PRESSO ALTRE AMMINISTRAZIONI",null,null,null,null,null,null,null,null,null,{"$f":"IF(G11<DATE(2009,1,1),DATE(2009,1,1),G11+1)","v":"2009-01-01"}]
[null,null,null,null,{"$f":"IF(AND(E17=\"\",G17>0),\"DATO OBBLIGATORIO\",IF(E17=\"\",\"\",IF(E17=VLOOKUP(E11,RIFERIMENTI!$H$1:$J$17,3,FALSE),\"\",\"ERRORE\")))","v":""},null,{"$f":"IF(E16=\"ERRORE\",\"GG/MM/AAAA\",IF(E17=\"\",\"GG/MM/AAAA\",IF(AND(E17>0,G17=\"\"),\"DATA ?\",IF(G17<=G11,\"ERRORE\",IF(G17<T17,\"ERRORE\",IF(G17>$T$13,\"ERRORE\",\"GG/MM/AAAA\"))))))","v":"GG/MM/AAAA"},null,null,"SCEGLIERE AMMINISTRAZIONE DA MENÙ A TENDINA",null,null,{"$f":"IF(AND(J17=0,M17=0),\"GG/MM/AAAA\",IF(AND(J17>0,M17=\"\"),\"DATA ?\",IF(AND(J17=\"\",M17>0),\"AMM.NE ?\",IF(M17<T15,\"ERRORE\",IF(M17>T13,\"ERRORE\",\"GG/MM/AAAA\")))))","v":"GG/MM/AAAA"},null,{"$f":"IF(AND(J17>0,O17=\"\"),\"DATA ?\",IF(AND(J17=\"\",O17>0),\"AMM.NE ?\",IF(O17<M17,\"ERRORE\",IF(O17>T13,\"ERRORE\",\"GG/MM/AAAA\"))))","v":"GG/MM/AAAA"},null,null," "]
[null,null,"2^ AREA/FASCIA CONSEGUITA:",null,"A3F2 (C1S)","DAL:","2016-01-01",null,null,"TRANSIZIONE ECOLOGICA",null,"DAL:","2009-05-05","AL:","2013-05-04",null,null,{"$f":"IF(E11=\"\",\"\",IF(ISNA(VLOOKUP(E11,RIFERIMENTI!$H$2:$J$17,3,FALSE)),\"\",IF(VLOOKUP(E11,RIFERIMENTI!$H$2:$J$17,3,FALSE)=0,\"\",VLOOKUP(E11,RIFERIMENTI!$H$2:$J$17,3,FALSE))))","v":"A3F2 (C1S)"},null,{"$f":"IF(E17=\"\",\"\",IF($G$11>VLOOKUP(E17,RIFERIMENTI!$H$1:$M$17,6,FALSE),$G$11,VLOOKUP(E17,RIFERIMENTI!$H$1:$M$17,6,FALSE)))","v":"2003-04-01"}]
[null,null,null,null,{"$f":"IF(AND(E19=\"\",G19>0),\"DATO OBBLIGATORIO\",IF(E19=\"\",\"\",IF(E17=\"\",\"\",IF(E19=VLOOKUP(E17,RIFERIMENTI!$H$2:$J$17,3,FALSE),\"\",\"ERRORE\"))))","v":""},null,{"$f":"IF(E18=\"ERRORE\",\"GG/MM/AAAA\",IF(E19=\"\",\"GG/MM/AAAA\",IF(AND(E19>0,G19=\"\"),\"DATA ?\",IF(G19<=G17,\"ERRORE\",IF(G19<T19,\"ERRORE\",IF(G19>$T$13,\"ERRORE\",\"GG/MM/AAAA\"))))))","v":"GG/MM/AAAA"},null,null,null,null,null,{"$f":"IF(AND(J19=0,M19=0),\"GG/MM/AAAA\",IF(AND(J19>0,M19=\"\"),\"DATA ?\",IF(AND(J19=\"\",M19>0),\"AMM.NE ?\",IF(M19<=O17,\"ERRORE\",IF(M19>T13,\"ERRORE\",\"GG/MM/AAAA\")))))","v":"GG/MM/AAAA"},null,{"$f":"IF(AND(J19>0,O19=\"\"),\"DATA ?\",IF(AND(J19=\"\",O19>0),\"AMM.NE ?\",IF(O19<M19,\"ERRORE\",IF(O19>T13,\"ERRORE\",\"GG/MM/AAAA\"))))","v":"GG/MM/AAAA"}]
[null,null,"3^ AREA/FASCIA CONSEGUITA:",null,"A3F3 (C2)","DAL:","2021-01-01",null,null,null,null,"DAL:",null,"AL:",null,null,null,{"$f":"IF(E17=\"\",\"\",IF(ISNA(VLOOKUP(E17,RIFERIMENTI!$H$2:$J$17,3,FALSE)),\"\",IF(VLOOKUP(E17,RIFERIMENTI!$H$2:$J$17,3,FALSE)=0,\"\",VLOOKUP(E17,RIFERIMENTI!$H$2:$J$17,3,FALSE))))","v":"A3F3 (C2)"},null,{"$f":"IF(E19=\"\",\"\",IF(G17+1>VLOOKUP(E19,RIFERIMENTI!$H$1:$M$17,6,FALSE),G17+1,VLOOKUP(E19,RIFERIMENTI!$H$1:$M$17,6,FALSE)))","v":"2016-01-02"}]
[null,null,null,null,{"$f":"IF(AND(E21=\"\",G21>0),\"DATO OBBLIGATORIO\",IF(E21=\"\",\"\",IF(E19=\"\",\"\",IF(E21=VLOOKUP(E19,RIFERIMENTI!$H$2:$J$17,3,FALSE),\"\",\"ERRORE\"))))","v":""},null,{"$f":"IF(E20=\"ERRORE\",\"GG/MM/AAAA\",IF(E21=\"\",\"GG/MM/AAAA\",IF(AND(E21>0,G21=\"\"),\"DATA ?\",IF(G21<=G19,\"ERRORE\",IF(G21<T21,\"ERRORE\",IF(G21>$T$13,\"ERRORE\",\"GG/MM/AAAA\"))))))","v":"GG/MM/AAAA"},null,null,null,null,null,{"$f":"IF(AND(J21=0,M21=0),\"GG/MM/AAAA\",IF(AND(J21>0,M21=\"\"),\"DATA ?\",IF(AND(J21=\"\",M21>0),\"AMM.NE ?\",IF(M21<=O19,\"ERRORE\",IF(M21>T13,\"ERRORE\",\"GG/MM/AAAA\")))))","v":"GG/MM/AAAA"},null,{"$f":"IF(AND(J21>0,O21=\"\"),\"DATA ?\",IF(AND(J21=\"\",O21>0),\"AMM.NE ?\",IF(O21<M21,\"ERRORE\",IF(O21>T13,\"ERRORE\",\"GG/MM/AAAA\"))))","v":"GG/MM/AAAA"}]
[null,null,"4^ AREA/FASCIA CONSEGUITA:",null,null,"DAL:",null,null,null,null,null,"DAL:",null,"AL:",null,null,null,{"$f":"IF(E19=\"\",\"\",IF(ISNA(VLOOKUP(E19,RIFERIMENTI!$H$2:$J$17,3,FALSE)),\"\",IF(VLOOKUP(E19,RIFERIMENTI!$H$2:$J$17,3,FALSE)=0,\"\",VLOOKUP(E19,RIFERIMENTI!$H$2:$J$17,3,FALSE))))","v":"A3F4 (C3)"},null,{"$f":"IF(E21=\"\",\"\",IF(G19+1>VLOOKUP(E21,RIFERIMENTI!$H$1:$M$17,6,FALSE),G19+1,VLOOKUP(E21,RIFERIMENTI!$H$1:$M$17,6,FALSE)))","v":""}]
[null,null,null,null,{"$f":"IF(AND(E23=\"\",G23>0),\"DATO OBBLIGATORIO\",IF(E23=\"\",\"\",IF(E21=\"\",\"\",IF(E23=VLOOKUP(E21,RIFERIMENTI!$H$2:$J$17,3,FALSE),\"\",\"ERRORE\"))))","v":""},null,{"$f":"IF(E22=\"ERRORE\",\"GG/MM/AAAA\",IF(E23=\"\",\"GG/MM/AAAA\",IF(AND(E23>0,G23=\"\"),\"DATA ?\",IF(G23<=G21,\"ERRORE\",IF(G23<T23,\"ERRORE\",IF(G23>$T$13,\"ERRORE\",\"GG/MM/AAAA\"))))))","v":"GG/MM/AAAA"},null,null,null,null,null,{"$f":"IF(AND(J23=0,M23=0),\"GG/MM/AAAA\",IF(AND(J23>0,M23=\"\"),\"DATA ?\",IF(AND(J23=\"\",M23>0),\"AMM.NE ?\",IF(M23<=O21,\"ERRORE\",IF(M23>T13,\"ERRORE\",\"GG/MM/AAAA\")))))","v":"GG/MM/AAAA"},null,{"$f":"IF(AND(J23>0,O23=\"\"),\"DATA ?\",IF(AND(J23=\"\",O23>0),\"AMM.NE ?\",IF(O23<M23,\"ERRORE\",IF(O23>T13,\"ERRORE\",\"GG/MM/AAAA\"))))","v":"GG/MM/AAAA"}]
[null,null,"5^ AREA/FASCIA CONSEGUITA:",null,null,"DAL:",null,null,null,null,null,"DAL:",null,"AL:",null,null,null,{"$f":"IF(E21=\"\",\"\",IF(ISNA(VLOOKUP(E21,RIFERIMENTI!$H$2:$J$17,3,FALSE)),\"\",IF(VLOOKUP(E21,RIFERIMENTI!$H$2:$J$17,3,FALSE)=0,\"\",VLOOKUP(E21,RIFERIMENTI!$H$2:$J$17,3,FALSE))))","v":""},null,{"$f":"IF(E23=\"\",\"\",IF(G21+1>VLOOKUP(E23,RIFERIMENTI!$H$1:$M$17,6,FALSE),G21+1,VLOOKUP(E23,RIFERIMENTI!$H$1:$M$17,6,FALSE)))","v":""}]
[null,null,null,null,{"$f":"IF(AND(E25=\"\",G25>0),\"DATO OBBLIGATORIO\",IF(E25=\"\",\"\",IF(E23=\"\",\"\",IF(E25=VLOOKUP(E23,RIFERIMENTI!$H$2:$J$17,3,FALSE),\"\",\"ERRORE\"))))","v":""},null,{"$f":"IF(E24=\"ERRORE\",\"GG/MM/AAAA\",IF(E25=\"\",\"GG/MM/AAAA\",IF(AND(E25>0,G25=\"\"),\"DATA ?\",IF(G25<=G23,\"ERRORE\",IF(G25<T25,\"ERRORE\",IF(G25>$T$13,\"ERRORE\",\"GG/MM/AAAA\"))))))","v":"GG/MM/AAAA"},null,null,null,null,null,{"$f":"IF(AND(J25=0,M25=0),\"GG/MM/AAAA\",IF(AND(J25>0,M25=\"\"),\"DATA ?\",IF(AND(J25=\"\",M25>0),\"AMM.NE ?\",IF(M25<=O23,\"ERRORE\",IF(M25>T13,\"ERRORE\",\"GG/MM/AAAA\")))))","v":"GG/MM/AAAA"},null,{"$f":"IF(AND(J25>0,O25=\"\"),\"DATA ?\",IF(AND(J25=\"\",O25>0),\"AMM.NE ?\",IF(O25<M25,\"ERRORE\",IF(O25>T13,\"ERRORE\",\"GG/MM/AAAA\"))))","v":"GG/MM/AAAA"}]
[null,null,"6^ AREA/FASCIA CONSEGUITA:",null,null,"DAL:",null,null,null,null,null,"DAL:",null,"AL:",null,null,null,{"$f":"IF(E23=\"\",\"\",IF(ISNA(VLOOKUP(E23,RIFERIMENTI!$H$2:$J$17,3,FALSE)),\"\",IF(VLOOKUP(E23,RIFERIMENTI!$H$2:$J$17,3,FALSE)=0,\"\",VLOOKUP(E23,RIFERIMENTI!$H$2:$J$17,3,FALSE))))","v":""},null,{"$f":"IF(E25=\"\",\"\",IF(G23+1>VLOOKUP(E25,RIFERIMENTI!$H$1:$M$17,6,FALSE),G23+1,VLOOKUP(E25,RIFERIMENTI!$H$1:$M$17,6,FALSE)))","v":""}]
[null,null,null,null,{"$f":"IF(AND(E27=\"\",G27>0),\"DATO OBBLIGATORIO\",IF(E27=\"\",\"\",IF(E25=\"\",\"\",IF(E27=VLOOKUP(E25,RIFERIMENTI!$H$2:$J$17,3,FALSE),\"\",\"ERRORE\"))))","v":""},null,{"$f":"IF(E26=\"ERRORE\",\"GG/MM/AAAA\",IF(E27=\"\",\"GG/MM/AAAA\",IF(AND(E27>0,G27=\"\"),\"DATA ?\",IF(G27<=G25,\"ERRORE\",IF(G27<T27,\"ERRORE\",IF(G27>$T$13,\"ERRORE\",\"GG/MM/AAAA\"))))))","v":"GG/MM/AAAA"},null,null,null,null,null,{"$f":"IF(AND(J27=0,M27=0),\"GG/MM/AAAA\",IF(AND(J27>0,M27=\"\"),\"DATA ?\",IF(AND(J27=\"\",M27>0),\"AMM.NE ?\",IF(M27<=O25,\"ERRORE\",IF(M27>T13,\"ERRORE\",\"GG/MM/AAAA\")))))","v":"GG/MM/AAAA"},null,{"$f":"IF(AND(J27>0,O27=\"\"),\"DATA ?\",IF(AND(J27=\"\",O27>0),\"AMM.NE ?\",IF(O27<M27,\"ERRORE\",IF(O27>T13,\"ERRORE\",\"GG/MM/AAAA\"))))","v":"GG/MM/AAAA"}]
[null,null,"7^ AREA/FASCIA CONSEGUITA:",null,null,"DAL:",null,null,null,null,null,"DAL:",null,"AL:",null,null,null,{"$f":"IF(E25=\"\",\"\",IF(ISNA(VLOOKUP(E25,RIFERIMENTI!$H$2:$J$17,3,FALSE)),\"\",IF(VLOOKUP(E25,RIFERIMENTI!$H$2:$J$17,3,FALSE)=0,\"\",VLOOKUP(E25,RIFERIMENTI!$H$2:$J$17,3,FALSE))))","v":""},null,{"$f":"IF(E27=\"\",\"\",IF(G25+1>VLOOKUP(E27,RIFERIMENTI!$H$1:$M$17,6,FALSE),G25+1,VLOOKUP(E27,RIFERIMENTI!$H$1:$M$17,6,FALSE)))","v":""}]
[]
[null,null,null,null,null,null,null,null,null," "]
[null,null,null,null,null,null,null," "," "," ",null,null," "]
[]
[]
[null,null,null,null,null,null,null,null,null,null," "]
[null,null,null,null,null,null,null," "]

{"sheet":"SVILUPPO","index":1,"n_rows":82,"n_cols":76,"rows_kept":82,"cut":false,"hidden":false,"merged":[[1,2,2,16],[7,12,7,14],[14,20,14,29],[13,33,13,35],[13,36,13,48],[1,20,1,23],[13,2,13,4],[13,5,13,12],[5,2,5,3],[8,6,8,8],[9,2,9,3],[9,6,9,8],[7,10,7,11],[1,25,1,29],[11,6,11,8],[7,6,7,8],[11,10,11,13],[11,2,11,5],[7,2,7,5],[5,12,5,14],[9,10,9,11],[9,12,9,14],[5,4,5,8],[5,10,5,11]]}
[null,null,null,null,null,null,null,null,null,null,null,null,null,null,null," "]
[null,null,"MINISTERO DELLA DIFESA - DIREZIONE GENERALE PER IL PERSONALE CIVILE - III REPARTO - DIVISIONI 6^ E 7^",null,null,null,null,null,null,null,null,null,null,null,null,null,null,null,null,null,"EVENTUALI CONSEGUIMENTI DI PROGRESSIONI ECONOMICHE",null,null,null,null,"EVENTUALI PERIODI DI COMANDO PRESSO ALTRE AMMINISTRAZIONI"]
[null,null,null,null,null,null,null,null,null,null,null,null,null,null,null,null,null,null,null,null,null,null,null,"GG/MM/AAAA",null,null,null,"GG/MM/AAAA",null,"GG/MM/AAAA"]
[null,null,null,null,null,null,null,null,null,null,null,null,null,null,null,null,null,null,null,null,"2^ AREA/FASCIA CONSEGUITA:",{"$f":"IF(RIFERIMENTI!Q7=1,\"ERRORE\",IF(INSERIMENTO!E17=\"\",\"\",INSERIMENTO!E17))","v":"A3F2 (C1S)"},"DAL:",{"$f":"IF(RIFERIMENTI!Q13=1,\"ERRORE\",IF(INSERIMENTO!G17=\"\",\"\",INSERIMENTO!G17))","v":"2016-01-01"},null,{"$f":"IF(INSERIMENTO!J17=\"\",\"\",INSERIMENTO!J17)","v":"TRANSIZIONE ECOLOGICA"},"DAL:",{"$f":"IF(RIFERIMENTI!Q19=1,\"ERRORE\",IF(INSERIMENTO!M17=\"\",\"\",INSERIMENTO!M17))","v":"2009-05-05"},"AL:",{"$f":"IF(RIFERIMENTI!Q25=1,\"ERRORE\",IF(INSERIMENTO!O17=\"\",\"\",INSERIMENTO!O17))","v":"2013-05-04"}]
[null,null,null,null,null,null,null,null,null,null,null,null,null,null,null,null,null,null,null,null,null,null,null,"GG/MM/AAAA",null,null,null,"GG/MM/AAAA",null,"GG/MM/AAAA"]
[null,null,"NOMINATIVO:",null,{"$f":"IF(RIFERIMENTI!Q2=1,\"ERRORE\",IF(INSERIMENTO!E7=\"\",\"\",INSERIMENTO!E7))","v":"COLOMBO Cristoforo"},null,null,null,null,null,"CODICE FISCALE",null,{"$f":"IF(INSERIMENTO!M7=\"\",\"\",INSERIMENTO!M7)","v":""},null,null,null,null,null,null,null,"3^ AREA/FASCIA CONSEGUITA:",{"$f":"IF(RIFERIMENTI!Q8=1,\"ERRORE\",IF(INSERIMENTO!E19=\"\",\"\",INSERIMENTO!E19))","v":"A3F3 (C2)"},"DAL:",{"$f":"IF(RIFERIMENTI!Q14=1,\"ERRORE\",IF(INSERIMENTO!G19=\"\",\"\",INSERIMENTO!G19))","v":"2021-01-01"},null,{"$f":"IF(INSERIMENTO!J19=\"\",\"\",INSERIMENTO!J19)","v":""},"DAL:",{"$f":"IF(RIFERIMENTI!Q20=1,\"ERRORE\",IF(INSERIMENTO!M19=\"\",\"\",INSERIMENTO!M19))","v":""},"AL:",{"$f":"IF(RIFERIMENTI!Q26=1,\"ERRORE\",IF(INSERIMENTO!O19=\"\",\"\",INSERIMENTO!O19))","v":""},null,null,null,null,null,null,null,null,null,null,null,null,null,null,null,null,null,null,null,null,null,null,null," "]
[null,null,null,null,null,null,null,null,null,null,null,null,null,null,null,null,null,null,null,null,null,null,null,"GG/MM/AAAA",null,null,null,"GG/MM/AAAA",null,"GG/MM/AAAA"]
[null,null,"ASSEGNO PERSONALE RIASSORBIBILE ANNUO INIZIALE:",null,null,null,{"$f":"IF(RIFERIMENTI!Q3=1,\"ERRORE\",IF(INSERIMENTO!G9=\"\",0,INSERIMENTO!G9))","v":10650},null,null,null,"ENTE DI SERVIZIO:",null,{"$f":"IF(INSERIMENTO!M9=\"\",\"\",INSERIMENTO!M9)","v":"NAVARM (UFF/MAND: 122) "},null,null,null,null,null,null,null,"4^ AREA/FASCIA CONSEGUITA:",{"$f":"IF(RIFERIMENTI!Q9=1,\"ERRORE\",IF(INSERIMENTO!E21=\"\",\"\",INSERIMENTO!E21))","v":""},"DAL:",{"$f":"IF(RIFERIMENTI!Q15=1,\"ERRORE\",IF(INSERIMENTO!G21=\"\",\"\",INSERIMENTO!G21))","v":""},null,{"$f":"IF(INSERIMENTO!J21=\"\",\"\",INSERIMENTO!J21)","v":""},"DAL:",{"$f":"IF(RIFERIMENTI!Q21=1,\"ERRORE\",IF(INSERIMENTO!M21=\"\",\"\",INSERIMENTO!M21))","v":""},"AL:",{"$f":"IF(RIFERIMENTI!Q27=1,\"ERRORE\",IF(INSERIMENTO!O21=\"\",\"\",INSERIMENTO!O21))","v":""},null,null,null,null,null," "]
[null,null,null,null,null,null,null,null,null,null,null,null,null,null,null,null,null,null,null,null,null,null,null,"GG/MM/AAAA",null,null,null,"GG/MM/AAAA",null,"GG/MM/AAAA"]
[null,null,"AREA/FASCIA INIZIALE:",null,{"$f":"IF(RIFERIMENTI!Q4=1,\"ERRORE\",IF(INSERIMENTO!E11=\"\",\"\",INSERIMENTO!E11))","v":"A3F1 (C1)"},"DAL:",{"$f":"IF(RIFERIMENTI!Q5=1,\"ERRORE\",IF(INSERIMENTO!G11=\"\",\"\",INSERIMENTO!G11))","v":"2003-04-01"},null,null,null,"EVENTUALE R.I.A. ANNUA:",null,{"$f":"IF(INSERIMENTO!M11=\"\",0,INSERIMENTO!M11)","v":0},null,null,null," ",null,null,null,"5^ AREA/FASCIA CONSEGUITA:",{"$f":"IF(RIFERIMENTI!Q10=1,\"ERRORE\",IF(INSERIMENTO!E23=\"\",\"\",INSERIMENTO!E23))","v":""},"DAL:",{"$f":"IF(RIFERIMENTI!Q16=1,\"ERRORE\",IF(INSERIMENTO!G23=\"\",\"\",INSERIMENTO!G23))","v":""},null,{"$f":"IF(INSERIMENTO!J23=\"\",\"\",INSERIMENTO!J23)","v":""},"DAL:",{"$f":"IF(RIFERIMENTI!Q22=1,\"ERRORE\",IF(INSERIMENTO!M23=\"\",\"\",INSERIMENTO!M23))","v":""},"AL:",{"$f":"IF(RIFERIMENTI!Q28=1,\"ERRORE\",IF(INSERIMENTO!O23=\"\",\"\",INSERIMENTO!O23))","v":""},null,null,null," "," ",null,null," "]
[null,null,null,null,null,null,null,null,null,null,null,null,{"$f":"IF(J10=\"ASS. RIASS. PARAMETRATO AI TABELLARI PREVIGENTI AL CCNL 2016-2018:\",\"SI/NO\",\"\")","v":""},null,null,null,null,null,null,null,null,null,null,"GG/MM/AAAA",null,null,null,"GG/MM/AAAA",null,"GG/MM/AAAA",null,null,null," "]
[null,null,"EVENTUALI SVILUPPI ECONOMICI E PERIODI DI COMANDO: ",null,null,null,{"$f":"IF(RIFERIMENTI!S31>0,\"ERRORE/I\",\"LEGGERE RIEPILOGO A DESTRA\")","v":"LEGGERE RIEPILOGO A DESTRA"},null,null,null,"EVENTUALE ULTIMO GIORNO DI SERVIZIO :",null,null,null,{"$f":"IF(INSERIMENTO!N13=\"\",\"\",IF(RIFERIMENTI!Q6=1,\"ERRORE\",INSERIMENTO!N13))","v":""},null,null,null,null,null,"6^ AREA/FASCIA CONSEGUITA:",{"$f":"IF(RIFERIMENTI!Q11=1,\"ERRORE\",IF(INSERIMENTO!E25=\"\",\"\",INSERIMENTO!E25))","v":""},"DAL:",{"$f":"IF(RIFERIMENTI!Q17=1,\"ERRORE\",IF(INSERIMENTO!G25=\"\",\"\",INSERIMENTO!G25))","v":""},null,{"$f":"IF(INSERIMENTO!J25=\"\",\"\",INSERIMENTO!J25)","v":""},"DAL:",{"$f":"IF(RIFERIMENTI!Q23=1,\"ERRORE\",IF(INSERIMENTO!M25=\"\",\"\",INSERIMENTO!M25))","v":""},"AL:",{"$f":"IF(RIFERIMENTI!Q29=1,\"ERRORE\",IF(INSERIMENTO!O25=\"\",\"\",INSERIMENTO!O25))","v":""},null,null,null,null," "]
[null,null,null,null,null,null,null,null,null,null,null,null,null,null,null,null,null,null,null,null,null,null,null,"GG/MM/AAAA",null,null,null,"GG/MM/AAAA",null,"GG/MM/AAAA",null,null,null,null,null,null,null,null,null,null,null,null,null,null,null,null,null,null,null,null,null,null,null," "]
[null,null,{"$f":"CONCATENATE(\"NOMINATIVO: \",E6)","v":"NOMINATIVO: COLOMBO Cristoforo"},null,null,{"$f":"IF(RIFERIMENTI!Q31>0,\"ATTENZIONE!! ERRORE/I DI INSERIMENTO\",\"IMPORTI ANNUI PER 12 MENSILITA'\")","v":"IMPORTI ANNUI PER 12 MENSILITA'"},null,null,null,null,null,null,null,null,null,null,null,null,null,null,"7^ AREA/FASCIA CONSEGUITA:",{"$f":"IF(RIFERIMENTI!Q12=1,\"ERRORE\",IF(INSERIMENTO!E27=\"\",\"\",INSERIMENTO!E27))","v":""},"DAL:",{"$f":"IF(RIFERIMENTI!Q18=1,\"ERRORE\",IF(INSERIMENTO!G27=\"\",\"\",INSERIMENTO!G27))","v":""},null,{"$f":"IF(INSERIMENTO!J27=\"\",\"\",INSERIMENTO!J27)","v":""},"DAL:",{"$f":"IF(RIFERIMENTI!Q24=1,\"ERRORE\",IF(INSERIMENTO!M27=\"\",\"\",INSERIMENTO!M27))","v":""},"AL:",{"$f":"IF(RIFERIMENTI!Q30=1,\"ERRORE\",IF(INSERIMENTO!O27=\"\",\"\",INSERIMENTO!O27))","v":""},null,null,null,{"$f":"C14","v":"NOMINATIVO: COLOMBO Cristoforo"},null,null,{"$f":"F14","v":"IMPORTI ANNUI PER 12 MENSILITA'"},null,null,null,null,null,null,null,null,null,null,null,null,null,null,null,null,null,null,null,null,null,null,null,null,null,null,null,null,null,null,null,null,null,null,null,null,null," "]
[null,null,"DAL","AL","A/F","STIP.\n+\nI.I.S.",null,"DIFF.LE ART. 52\nCCNL 19/21","VAC. CONTR.\ncon magg.ne\nD.L. 145/2023","R.I.A.","differenza retributiva rispetto al periodo precedente","ASS. RIASS. ANNUO","TOTALE",null,"ASS. RIASS. MENSILE\n(importi in €uro)",null,"MISURA IND. AMM.NE",null,null,null,"RIEPILOGO SCHEDA \"INSERIMENTO\"",null,null,null,null,null,null,null,null,null,null,null,null,"DAL","AL","A/F","   STIP. + I.I.S.","IND. AMM. DIFESA","IND. AMM. EFFETTIVA","IND. AMM. DIFFERENZA","DIFF.LE ART. 52\nCCNL 19/21","VAC. CONTR.","R.I.A.","INCREMENTO DIFESA","INCREMENTO EFFETTIVO","ASS. RIASS. DIFESA","ASS. RIASS. EFFETTIVO","TOTALE\nDIFESA","TOTALE\nEFFETTIVO",null,"ASS. RIASS. MENSILE",null,null,null,null,null,null,"MISURA\nIND. AMM.NE",null,"TOTALE","TOTALE",null,"TOTALE"]
[null,null,{"$f":"IF(RIFERIMENTI!$Q$31>0,\"\",RIFERIMENTI!AJ2)","v":"2003-04-01"},{"$f":"IF(RIFERIMENTI!$Q$31>0,\"\",RIFERIMENTI!AK2)","v":"2003-12-31"},{"$f":"IF(C16=\"\",\"\",IF(RIFERIMENTI!$Q$31=1,\"\",LOOKUP(C16,RIFERIMENTI!$V$49:$V$55,RIFERIMENTI!$W$49:$W$55)))","v":"A3F1 (C1)"},{"$f":"IF(C16=\"\",0,(LOOKUP(CONCATENATE(E16,\" \",C16),STIPENDIO!$B$5:$B$391,STIPENDIO!$H$5:$H$391))+(LOOKUP(CONCATENATE(E16,\" \",C16),'IND. INT. SPEC.'!$B$6:$B$39,'IND. INT. SPEC.'!$H$6:$H$39)))","v":17855.12},{"$f":"IF(C16=\"\",0,IF(BC16=\"DIF\",LOOKUP(CONCATENATE(E16,\" \",C16),'IND. AMM.NE'!$C$6:$C$166,'IND. AMM.NE'!$L$6:$L$166),VLOOKUP(CONCATENATE(BC16,\" \",BB16),'IND. AMM.NE'!$A$171:$X$253,BD16,TRUE)))","v":2408.88},{"$f":"IF(C16=\"\",0,LOOKUP(CONCATENATE(E16,\" \",C16),'CCNL 2019-2021'!$C$99:$C$130,'CCNL 2019-2021'!$J$99:$J$130))","v":0},{"$f":"IF(C16=\"\",0,LOOKUP(CONCATENATE(E16,\" \",C16),'VACANZA CONTR.LE'!$B$5:$B$300,'VACANZA CONTR.LE'!$J$5:$J$300))","v":0},{"$f":"IF(C16=\"\",0,$M$10)","v":0},0,{"$f":"AU16","v":10650},{"$f":"F16+G16+H16+I16+J16+L16","v":30914},null,{"$f":"ROUND(L16/12,2)","v":887.5},null,{"$f":"BC16","v":"DIF"},null,null,null,null,null,null,null,null,null,null,null,null,null,null,null,null,{"$f":"C16","v":"2003-04-01"},{"$f":"D16","v":"2003-12-31"},{"$f":"E16","v":"A3F1 (C1)"},{"$f":"F16","v":17855.12},{"$f":"IF(C16=\"\",0,LOOKUP(CONCATENATE(E16,\" \",C16),'IND. AMM.NE'!$C$6:$C$166,'IND. AMM.NE'!$L$6:$L$166))","v":2408.88},{"$f":"G16","v":2408.88},{"$f":"AM16-AL16","v":0},{"$f":"H16","v":0},{"$f":"I16","v":0},{"$f":"J16","v":0},{"$f":"K16","v":0},{"$f":"K16","v":0},{"$f":"IF(AH16=\"\",0,G8)","v":10650},{"$f":"AT16","v":10650},{"$f":"AK16+AL16+AO16+AP16+AQ16+AT16","v":30914},{"$f":"AK16+AM16+AO16+AP16+AQ16+AU16","v":30914},null,{"$f":"ROUND(AT16/12,2)","v":887.5},null,null,{"$f":"C16","v":"2003-04-01"},{"$f":"IF(C16=\"\",\"\",IF(ISNA(LOOKUP(BB16,RIFERIMENTI!$P$56:$P$70,RIFERIMENTI!$S$56:$S$70)),\"DIF\",LOOKUP(BB16,RIFERIMENTI!$P$56:$P$70,RIFERIMENTI!$S$56:$S$70)))","v":"DIF"},{"$f":"IF(BB16=\"\",\"\",IF(BC16=\"DIF\",0,VLOOKUP(E16,RIFERIMENTI!$H$2:$N$17,7,FALSE)))","v":0},null,{"$f":"IF(ISNA(VLOOKUP(BC16,'IND. AMM.NE'!$U$4:$V$26,2,FALSE)),\"DIFESA\",VLOOKUP(BC16,'IND. AMM.NE'!$U$4:$V$26,2,FALSE))","v":"DIFESA"},null,{"$f":"IF(M16>0,1,0)","v":1},">0"," ",0," "," "," "," "," "," "]
[null,null,{"$f":"IF(RIFERIMENTI!$Q$31>0,\"\",RIFERIMENTI!AJ3)","v":"2004-01-01"},{"$f":"IF(RIFERIMENTI!$Q$31>0,\"\",RIFERIMENTI!AK3)","v":"2005-01-31"},{"$f":"IF(C17=\"\",\"\",IF(RIFERIMENTI!$Q$31=1,\"\",LOOKUP(C17,RIFERIMENTI!$V$49:$V$55,RIFERIMENTI!$W$49:$W$55)))","v":"A3F1 (C1)"},{"$f":"IF(C17=\"\",0,(LOOKUP(CONCATENATE(E17,\" \",C17),STIPENDIO!$B$5:$B$391,STIPENDIO!$H$5:$H$391))+(LOOKUP(CONCATENATE(E17,\" \",C17),'IND. INT. SPEC.'!$B$6:$B$39,'IND. INT. SPEC.'!$H$6:$H$39)))","v":18352.7},{"$f":"IF(C17=\"\",0,IF(BC17=\"DIF\",LOOKUP(CONCATENATE(E17,\" \",C17),'IND. AMM.NE'!$C$6:$C$166,'IND. AMM.NE'!$L$6:$L$166),VLOOKUP(CONCATENATE(BC17,\" \",BB17),'IND. AMM.NE'!$A$171:$X$253,BD17,TRUE)))","v":2408.88},{"$f":"IF(C17=\"\",0,LOOKUP(CONCATENATE(E17,\" \",C17),'CCNL 2019-2021'!$C$99:$C$130,'CCNL 2019-2021'!$J$99:$J$130))","v":0},{"$f":"IF(C17=\"\",0,LOOKUP(CONCATENATE(E17,\" \",C17),'VACANZA CONTR.LE'!$B$5:$B$300,'VACANZA CONTR.LE'!$J$5:$J$300))","v":0},{"$f":"IF(C17=\"\",0,$M$10)","v":0},{"$f":"IF(C17=\"\",0,SUM(F17:J17)-SUM(F16:J16))","v":497.58000000000175},10152.419999999998,30914,null,846.04,null,{"$f":"BC17","v":"DIF"},null,null,null,null,null,null,null,null,null,null,null,null,null,null,null,null,{"$f":"C17","v":"2004-01-01"},{"$f":"D17","v":"2005-01-31"},{"$f":"E17","v":"A3F1 (C1)"},{"$f":"F17","v":18352.7},{"$f":"IF(C17=\"\",0,LOOKUP(CONCATENATE(E17,\" \",C17),'IND. AMM.NE'!$C$6:$C$166,'IND. AMM.NE'!$L$6:$L$166))","v":2408.88},{"$f":"G17","v":2408.88},{"$f":"AM17-AL17","v":0},{"$f":"H17","v":0},{"$f":"I17","v":0},{"$f":"J17","v":0},{"$f":"IF(AH17=\"\",0,(AK17+AL17+AO17+AP17+AQ17)-(AK16+AL16+AO16+AP16+AQ16))","v":497.58000000000175},{"$f":"IF(AH17=\"\",0,(AK17+AM17+AO17+AP17+AQ17)-(AK16+AL16+AO16+AP16+AQ16))","v":497.58000000000175},{"$f":"IF(AH17=\"\",0,IF(AND(Q16=\"DIF\",AH17=DATE(2022,11,1),((AK17+AM17+AO17+AP17+AQ17)+(AT16-AR17))>$AV$16,($AV$16-(AK17+AM17+AO17+AP17+AQ17))<0),0,IF(AND(Q16=\"DIF\",AH17=DATE(2022,11,1),((AK17+AM17+AO17+AP17+AQ17)+(AT16-AR17))>$AV$16),$AV$16-(AK17+AM17+AO17+AP17+AQ17),IF(AND(Q16=\"DIF\",AH17=DATE(2022,11,1)),AT16-AR17,IF(AT16=0,0,IF((AT16-AR17)>0,AT16-AR17,0))))))","v":10152.419999999998},{"$f":"IF(AH17=\"\",0,IF(AND(Q16=\"DIF\",AH17=DATE(2022,11,1),((AK17+AM17+AO17+AP17+AQ17)+(AT16-AS17))>$AV$16,($AV$16-(AK17+AM17+AO17+AP17+AQ17))<0),0,IF(AND(Q16=\"DIF\",AH17=DATE(2022,11,1),((AK17+AM17+AO17+AP17+AQ17)+(AT16-AS17))>$AV$16),$AV$16-(AK17+AM17+AO17+AP17+AQ17),IF(AND(Q16=\"DIF\",AH17=DATE(2022,11,1)),AT16-AS17,IF(AT16=0,0,IF((AT16-AS17)>0,AT16-AS17,0))))))","v":10152.419999999998},{"$f":"AK17+AL17+AO17+AP17+AQ17+AT17","v":30914},{"$f":"AK17+AM17+AO17+AP17+AQ17+AU17","v":30914},null,846.04,null,null,{"$f":"C17","v":"2004-01-01"},{"$f":"IF(C17=\"\",\"\",IF(ISNA(LOOKUP(BB17,RIFERIMENTI!$P$56:$P$70,RIFERIMENTI!$S$56:$S$70)),\"DIF\",LOOKUP(BB17,RIFERIMENTI!$P$56:$P$70,RIFERIMENTI!$S$56:$S$70)))","v":"DIF"},{"$f":"IF(BB17=\"\",\"\",IF(BC17=\"DIF\",0,VLOOKUP(E17,RIFERIMENTI!$H$2:$N$17,7,FALSE)))","v":0},null,{"$f":"IF(ISNA(VLOOKUP(BC17,'IND. AMM.NE'!$U$4:$V$26,2,FALSE)),\"DIFESA\",VLOOKUP(BC17,'IND. AMM.NE'!$U$4:$V$26,2,FALSE))","v":"DIFESA"},null,{"$f":"IF(M17>0,1,0)","v":1},null,null,">0"]
[null,null,{"$f":"IF(RIFERIMENTI!$Q$31>0,\"\",RIFERIMENTI!AJ4)","v":"2005-02-01"},{"$f":"IF(RIFERIMENTI!$Q$31>0,\"\",RIFERIMENTI!AK4)","v":"2005-12-30"},{"$f":"IF(C18=\"\",\"\",IF(RIFERIMENTI!$Q$31=1,\"\",LOOKUP(C18,RIFERIMENTI!$V$49:$V$55,RIFERIMENTI!$W$49:$W$55)))","v":"A3F1 (C1)"},{"$f":"IF(C18=\"\",0,(LOOKUP(CONCATENATE(E18,\" \",C18),STIPENDIO!$B$5:$B$391,STIPENDIO!$H$5:$H$391))+(LOOKUP(CONCATENATE(E18,\" \",C18),'IND. INT. SPEC.'!$B$6:$B$39,'IND. INT. SPEC.'!$H$6:$H$39)))","v":18995.66},{"$f":"IF(C18=\"\",0,IF(BC18=\"DIF\",LOOKUP(CONCATENATE(E18,\" \",C18),'IND. AMM.NE'!$C$6:$C$166,'IND. AMM.NE'!$L$6:$L$166),VLOOKUP(CONCATENATE(BC18,\" \",BB18),'IND. AMM.NE'!$A$171:$X$253,BD18,TRUE)))","v":2408.88},{"$f":"IF(C18=\"\",0,LOOKUP(CONCATENATE(E18,\" \",C18),'CCNL 2019-2021'!$C$99:$C$130,'CCNL 2019-2021'!$J$99:$J$130))","v":0},{"$f":"IF(C18=\"\",0,LOOKUP(CONCATENATE(E18,\" \",C18),'VACANZA CONTR.LE'!$B$5:$B$300,'VACANZA CONTR.LE'!$J$5:$J$300))","v":0},0,642.95999999999913,9509.4599999999991,30914,null,792.46,null,"DIF",null,null,null,null,null,null,null,null,null,null,null,null,null,null,null,null,"2005-02-01","2005-12-30","A3F1 (C1)",18995.66,{"$f":"IF(C18=\"\",0,LOOKUP(CONCATENATE(E18,\" \",C18),'IND. AMM.NE'!$C$6:$C$166,'IND. AMM.NE'!$L$6:$L$166))","v":2408.88},2408.88,0,0,0,0,{"$f":"IF(AH18=\"\",0,(AK18+AL18+AO18+AP18+AQ18)-(AK17+AL17+AO17+AP17+AQ17))","v":642.95999999999913},{"$f":"IF(AH18=\"\",0,(AK18+AM18+AO18+AP18+AQ18)-(AK17+AL17+AO17+AP17+AQ17))","v":642.95999999999913},9509.4599999999991,9509.4599999999991,30914,30914,null,792.46,null,null,"2005-02-01",{"$f":"IF(C18=\"\",\"\",IF(ISNA(LOOKUP(BB18,RIFERIMENTI!$P$56:$P$70,RIFERIMENTI!$S$56:$S$70)),\"DIF\",LOOKUP(BB18,RIFERIMENTI!$P$56:$P$70,RIFERIMENTI!$S$56:$S$70)))","v":"DIF"},{"$f":"IF(BB18=\"\",\"\",IF(BC18=\"DIF\",0,VLOOKUP(E18,RIFERIMENTI!$H$2:$N$17,7,FALSE)))","v":0},null,{"$f":"IF(ISNA(VLOOKUP(BC18,'IND. AMM.NE'!$U$4:$V$26,2,FALSE)),\"DIFESA\",VLOOKUP(BC18,'IND. AMM.NE'!$U$4:$V$26,2,FALSE))","v":"DIFESA"},null,1]
[null,null,{"$f":"IF(RIFERIMENTI!$Q$31>0,\"\",RIFERIMENTI!AJ5)","v":"2005-12-31"},{"$f":"IF(RIFERIMENTI!$Q$31>0,\"\",RIFERIMENTI!AK5)","v":"2005-12-31"},{"$f":"IF(C19=\"\",\"\",IF(RIFERIMENTI!$Q$31=1,\"\",LOOKUP(C19,RIFERIMENTI!$V$49:$V$55,RIFERIMENTI!$W$49:$W$55)))","v":"A3F1 (C1)"},{"$f":"IF(C19=\"\",0,(LOOKUP(CONCATENATE(E19,\" \",C19),STIPENDIO!$B$5:$B$391,STIPENDIO!$H$5:$H$391))+(LOOKUP(CONCATENATE(E19,\" \",C19),'IND. INT. SPEC.'!$B$6:$B$39,'IND. INT. SPEC.'!$H$6:$H$39)))","v":19048.62},{"$f":"IF(C19=\"\",0,IF(BC19=\"DIF\",LOOKUP(CONCATENATE(E19,\" \",C19),'IND. AMM.NE'!$C$6:$C$166,'IND. AMM.NE'!$L$6:$L$166),VLOOKUP(CONCATENATE(BC19,\" \",BB19),'IND. AMM.NE'!$A$171:$X$253,BD19,TRUE)))","v":2408.88},{"$f":"IF(C19=\"\",0,LOOKUP(CONCATENATE(E19,\" \",C19),'CCNL 2019-2021'!$C$99:$C$130,'CCNL 2019-2021'!$J$99:$J$130))","v":0},{"$f":"IF(C19=\"\",0,LOOKUP(CONCATENATE(E19,\" \",C19),'VACANZA CONTR.LE'!$B$5:$B$300,'VACANZA CONTR.LE'!$J$5:$J$300))","v":0},0,52.959999999999127,9456.5,30914,null,788.04,null,"DIF",null,null,null,null,null,null,null,null,null,null,null,null,null,null,null,null,"2005-12-31","2005-12-31","A3F1 (C1)",19048.62,{"$f":"IF(C19=\"\",0,LOOKUP(CONCATENATE(E19,\" \",C19),'IND. AMM.NE'!$C$6:$C$166,'IND. AMM.NE'!$L$6:$L$166))","v":2408.88},2408.88,0,0,0,0,52.959999999999127,52.959999999999127,9456.5,9456.5,30914,30914,null,788.04,null,null,"2005-12-31",{"$f":"IF(C19=\"\",\"\",IF(ISNA(LOOKUP(BB19,RIFERIMENTI!$P$56:$P$70,RIFERIMENTI!$S$56:$S$70)),\"DIF\",LOOKUP(BB19,RIFERIMENTI!$P$56:$P$70,RIFERIMENTI!$S$56:$S$70)))","v":"DIF"},{"$f":"IF(BB19=\"\",\"\",IF(BC19=\"DIF\",0,VLOOKUP(E19,RIFERIMENTI!$H$2:$N$17,7,FALSE)))","v":0},null,{"$f":"IF(ISNA(VLOOKUP(BC19,'IND. AMM.NE'!$U$4:$V$26,2,FALSE)),\"DIFESA\",VLOOKUP(BC19,'IND. AMM.NE'!$U$4:$V$26,2,FALSE))","v":"DIFESA"},null,1]
[null,null,{"$f":"IF(RIFERIMENTI!$Q$31>0,\"\",RIFERIMENTI!AJ6)","v":"2006-01-01"},{"$f":"IF(RIFERIMENTI!$Q$31>0,\"\",RIFERIMENTI!AK6)","v":"2006-12-31"},{"$f":"IF(C20=\"\",\"\",IF(RIFERIMENTI!$Q$31=1,\"\",LOOKUP(C20,RIFERIMENTI!$V$49:$V$55,RIFERIMENTI!$W$49:$W$55)))","v":"A3F1 (C1)"},{"$f":"IF(C20=\"\",0,(LOOKUP(CONCATENATE(E20,\" \",C20),STIPENDIO!$B$5:$B$391,STIPENDIO!$H$5:$H$391))+(LOOKUP(CONCATENATE(E20,\" \",C20),'IND. INT. SPEC.'!$B$6:$B$39,'IND. INT. SPEC.'!$H$6:$H$39)))","v":19154.34},{"$f":"IF(C20=\"\",0,IF(BC20=\"DIF\",LOOKUP(CONCATENATE(E20,\" \",C20),'IND. AMM.NE'!$C$6:$C$166,'IND. AMM.NE'!$L$6:$L$166),VLOOKUP(CONCATENATE(BC20,\" \",BB20),'IND. AMM.NE'!$A$171:$X$253,BD20,TRUE)))","v":2408.88},{"$f":"IF(C20=\"\",0,LOOKUP(CONCATENATE(E20,\" \",C20),'CCNL 2019-2021'!$C$99:$C$130,'CCNL 2019-2021'!$J$99:$J$130))","v":0},{"$f":"IF(C20=\"\",0,LOOKUP(CONCATENATE(E20,\" \",C20),'VACANZA CONTR.LE'!$B$5:$B$300,'VACANZA CONTR.LE'!$J$5:$J$300))","v":0},0,105.72000000000116,9350.7799999999988,30914,null,779.23,null,"DIF",null,null,null,null,null,null,null,null,null,null,null,null,null,null,null,null,"2006-01-01","2006-12-31","A3F1 (C1)",19154.34,{"$f":"IF(C20=\"\",0,LOOKUP(CONCATENATE(E20,\" \",C20),'IND. AMM.NE'!$C$6:$C$166,'IND. AMM.NE'!$L$6:$L$166))","v":2408.88},2408.88,0,0,0,0,105.72000000000116,105.72000000000116,9350.7799999999988,9350.7799999999988,30914,30914,null,779.23,null,null,"2006-01-01",{"$f":"IF(C20=\"\",\"\",IF(ISNA(LOOKUP(BB20,RIFERIMENTI!$P$56:$P$70,RIFERIMENTI!$S$56:$S$70)),\"DIF\",LOOKUP(BB20,RIFERIMENTI!$P$56:$P$70,RIFERIMENTI!$S$56:$S$70)))","v":"DIF"},{"$f":"IF(BB20=\"\",\"\",IF(BC20=\"DIF\",0,VLOOKUP(E20,RIFERIMENTI!$H$2:$N$17,7,FALSE)))","v":0},null,{"$f":"IF(ISNA(VLOOKUP(BC20,'IND. AMM.NE'!$U$4:$V$26,2,FALSE)),\"DIFESA\",VLOOKUP(BC20,'IND. AMM.NE'!$U$4:$V$26,2,FALSE))","v":"DIFESA"},null,1,null,null,null,null," ",null," "]
[null,null,{"$f":"IF(RIFERIMENTI!$Q$31>0,\"\",RIFERIMENTI!AJ7)","v":"2007-01-01"},{"$f":"IF(RIFERIMENTI!$Q$31>0,\"\",RIFERIMENTI!AK7)","v":"2007-01-31"},{"$f":"IF(C21=\"\",\"\",IF(RIFERIMENTI!$Q$31=1,\"\",LOOKUP(C21,RIFERIMENTI!$V$49:$V$55,RIFERIMENTI!$W$49:$W$55)))","v":"A3F1 (C1)"},{"$f":"IF(C21=\"\",0,(LOOKUP(CONCATENATE(E21,\" \",C21),STIPENDIO!$B$5:$B$391,STIPENDIO!$H$5:$H$391))+(LOOKUP(CONCATENATE(E21,\" \",C21),'IND. INT. SPEC.'!$B$6:$B$39,'IND. INT. SPEC.'!$H$6:$H$39)))","v":19587.18},{"$f":"IF(C21=\"\",0,IF(BC21=\"DIF\",LOOKUP(CONCATENATE(E21,\" \",C21),'IND. AMM.NE'!$C$6:$C$166,'IND. AMM.NE'!$L$6:$L$166),VLOOKUP(CONCATENATE(BC21,\" \",BB21),'IND. AMM.NE'!$A$171:$X$253,BD21,TRUE)))","v":2408.88},{"$f":"IF(C21=\"\",0,LOOKUP(CONCATENATE(E21,\" \",C21),'CCNL 2019-2021'!$C$99:$C$130,'CCNL 2019-2021'!$J$99:$J$130))","v":0},{"$f":"IF(C21=\"\",0,LOOKUP(CONCATENATE(E21,\" \",C21),'VACANZA CONTR.LE'!$B$5:$B$300,'VACANZA CONTR.LE'!$J$5:$J$300))","v":0},0,432.84000000000015,8917.9399999999987,30914,null,743.16,null,"DIF",null,null,null,null,null,null,null,null,null,null,null,null,null,null,null,null,"2007-01-01","2007-01-31","A3F1 (C1)",19587.18,{"$f":"IF(C21=\"\",0,LOOKUP(CONCATENATE(E21,\" \",C21),'IND. AMM.NE'!$C$6:$C$166,'IND. AMM.NE'!$L$6:$L$166))","v":2408.88},2408.88,0,0,0,0,432.84000000000015,432.84000000000015,8917.9399999999987,8917.9399999999987,30914,30914,null,743.16,null,null,"2007-01-01",{"$f":"IF(C21=\"\",\"\",IF(ISNA(LOOKUP(BB21,RIFERIMENTI!$P$56:$P$70,RIFERIMENTI!$S$56:$S$70)),\"DIF\",LOOKUP(BB21,RIFERIMENTI!$P$56:$P$70,RIFERIMENTI!$S$56:$S$70)))","v":"DIF"},{"$f":"IF(BB21=\"\",\"\",IF(BC21=\"DIF\",0,VLOOKUP(E21,RIFERIMENTI!$H$2:$N$17,7,FALSE)))","v":0},null,{"$f":"IF(ISNA(VLOOKUP(BC21,'IND. AMM.NE'!$U$4:$V$26,2,FALSE)),\"DIFESA\",VLOOKUP(BC21,'IND. AMM.NE'!$U$4:$V$26,2,FALSE))","v":"DIFESA"},null,1]
[null,null,{"$f":"IF(RIFERIMENTI!$Q$31>0,\"\",RIFERIMENTI!AJ8)","v":"2007-02-01"},{"$f":"IF(RIFERIMENTI!$Q$31>0,\"\",RIFERIMENTI!AK8)","v":"2007-12-30"},{"$f":"IF(C22=\"\",\"\",IF(RIFERIMENTI!$Q$31=1,\"\",LOOKUP(C22,RIFERIMENTI!$V$49:$V$55,RIFERIMENTI!$W$49:$W$55)))","v":"A3F1 (C1)"},{"$f":"IF(C22=\"\",0,(LOOKUP(CONCATENATE(E22,\" \",C22),STIPENDIO!$B$5:$B$391,STIPENDIO!$H$5:$H$391))+(LOOKUP(CONCATENATE(E22,\" \",C22),'IND. INT. SPEC.'!$B$6:$B$39,'IND. INT. SPEC.'!$H$6:$H$39)))","v":20220.66},{"$f":"IF(C22=\"\",0,IF(BC22=\"DIF\",LOOKUP(CONCATENATE(E22,\" \",C22),'IND. AMM.NE'!$C$6:$C$166,'IND. AMM.NE'!$L$6:$L$166),VLOOKUP(CONCATENATE(BC22,\" \",BB22),'IND. AMM.NE'!$A$171:$X$253,BD22,TRUE)))","v":2408.88},{"$f":"IF(C22=\"\",0,LOOKUP(CONCATENATE(E22,\" \",C22),'CCNL 2019-2021'!$C$99:$C$130,'CCNL 2019-2021'!$J$99:$J$130))","v":0},{"$f":"IF(C22=\"\",0,LOOKUP(CONCATENATE(E22,\" \",C22),'VACANZA CONTR.LE'!$B$5:$B$300,'VACANZA CONTR.LE'!$J$5:$J$300))","v":0},0,633.47999999999956,8284.4599999999991,30914,null,690.37,null,"DIF",null,null,null,null,null,null,null,null,null,null,null,null,null,null,null,null,"2007-02-01","2007-12-30","A3F1 (C1)",20220.66,{"$f":"IF(C22=\"\",0,LOOKUP(CONCATENATE(E22,\" \",C22),'IND. AMM.NE'!$C$6:$C$166,'IND. AMM.NE'!$L$6:$L$166))","v":2408.88},2408.88,0,0,0,0,633.47999999999956,633.47999999999956,8284.4599999999991,8284.4599999999991,30914,30914,null,690.37,null,null,"2007-02-01",{"$f":"IF(C22=\"\",\"\",IF(ISNA(LOOKUP(BB22,RIFERIMENTI!$P$56:$P$70,RIFERIMENTI!$S$56:$S$70)),\"DIF\",LOOKUP(BB22,RIFERIMENTI!$P$56:$P$70,RIFERIMENTI!$S$56:$S$70)))","v":"DIF"},{"$f":"IF(BB22=\"\",\"\",IF(BC22=\"DIF\",0,VLOOKUP(E22,RIFERIMENTI!$H$2:$N$17,7,FALSE)))","v":0},null,{"$f":"IF(ISNA(VLOOKUP(BC22,'IND. AMM.NE'!$U$4:$V$26,2,FALSE)),\"DIFESA\",VLOOKUP(BC22,'IND. AMM.NE'!$U$4:$V$26,2,FALSE))","v":"DIFESA"},null,1,null,null,null,null," "]
[null,null,{"$f":"IF(RIFERIMENTI!$Q$31>0,\"\",RIFERIMENTI!AJ9)","v":"2007-12-31"},{"$f":"IF(RIFERIMENTI!$Q$31>0,\"\",RIFERIMENTI!AK9)","v":"2007-12-31"},{"$f":"IF(C23=\"\",\"\",IF(RIFERIMENTI!$Q$31=1,\"\",LOOKUP(C23,RIFERIMENTI!$V$49:$V$55,RIFERIMENTI!$W$49:$W$55)))","v":"A3F1 (C1)"},{"$f":"IF(C23=\"\",0,(LOOKUP(CONCATENATE(E23,\" \",C23),STIPENDIO!$B$5:$B$391,STIPENDIO!$H$5:$H$391))+(LOOKUP(CONCATENATE(E23,\" \",C23),'IND. INT. SPEC.'!$B$6:$B$39,'IND. INT. SPEC.'!$H$6:$H$39)))","v":20220.66},{"$f":"IF(C23=\"\",0,IF(BC23=\"DIF\",LOOKUP(CONCATENATE(E23,\" \",C23),'IND. AMM.NE'!$C$6:$C$166,'IND. AMM.NE'!$L$6:$L$166),VLOOKUP(CONCATENATE(BC23,\" \",BB23),'IND. AMM.NE'!$A$171:$X$253,BD23,TRUE)))","v":2772.72},{"$f":"IF(C23=\"\",0,LOOKUP(CONCATENATE(E23,\" \",C23),'CCNL 2019-2021'!$C$99:$C$130,'CCNL 2019-2021'!$J$99:$J$130))","v":0},{"$f":"IF(C23=\"\",0,LOOKUP(CONCATENATE(E23,\" \",C23),'VACANZA CONTR.LE'!$B$5:$B$300,'VACANZA CONTR.LE'!$J$5:$J$300))","v":0},0,363.84000000000015,7920.619999999999,30914,null,660.05,null,"DIF",null,null,null,null,null,null,null,null,null,null,null,null,null,null,null,null,"2007-12-31","2007-12-31","A3F1 (C1)",20220.66,{"$f":"IF(C23=\"\",0,LOOKUP(CONCATENATE(E23,\" \",C23),'IND. AMM.NE'!$C$6:$C$166,'IND. AMM.NE'!$L$6:$L$166))","v":2772.72},2772.72,0,0,0,0,363.84000000000015,363.84000000000015,7920.619999999999,7920.619999999999,30914,30914,null,660.05,null,null,"2007-12-31",{"$f":"IF(C23=\"\",\"\",IF(ISNA(LOOKUP(BB23,RIFERIMENTI!$P$56:$P$70,RIFERIMENTI!$S$56:$S$70)),\"DIF\",LOOKUP(BB23,RIFERIMENTI!$P$56:$P$70,RIFERIMENTI!$S$56:$S$70)))","v":"DIF"},{"$f":"IF(BB23=\"\",\"\",IF(BC23=\"DIF\",0,VLOOKUP(E23,RIFERIMENTI!$H$2:$N$17,7,FALSE)))","v":0},null,{"$f":"IF(ISNA(VLOOKUP(BC23,'IND. AMM.NE'!$U$4:$V$26,2,FALSE)),\"DIFESA\",VLOOKUP(BC23,'IND. AMM.NE'!$U$4:$V$26,2,FALSE))","v":"DIFESA"},null,1,null,null,null,null," "]
[null,null,{"$f":"IF(RIFERIMENTI!$Q$31>0,\"\",RIFERIMENTI!AJ10)","v":"2008-01-01"},{"$f":"IF(RIFERIMENTI!$Q$31>0,\"\",RIFERIMENTI!AK10)","v":"2008-12-31"},{"$f":"IF(C24=\"\",\"\",IF(RIFERIMENTI!$Q$31=1,\"\",LOOKUP(C24,RIFERIMENTI!$V$49:$V$55,RIFERIMENTI!$W$49:$W$55)))","v":"A3F1 (C1)"},{"$f":"IF(C24=\"\",0,(LOOKUP(CONCATENATE(E24,\" \",C24),STIPENDIO!$B$5:$B$391,STIPENDIO!$H$5:$H$391))+(LOOKUP(CONCATENATE(E24,\" \",C24),'IND. INT. SPEC.'!$B$6:$B$39,'IND. INT. SPEC.'!$H$6:$H$39)))","v":20333.7},{"$f":"IF(C24=\"\",0,IF(BC24=\"DIF\",LOOKUP(CONCATENATE(E24,\" \",C24),'IND. AMM.NE'!$C$6:$C$166,'IND. AMM.NE'!$L$6:$L$166),VLOOKUP(CONCATENATE(BC24,\" \",BB24),'IND. AMM.NE'!$A$171:$X$253,BD24,TRUE)))","v":2772.72},{"$f":"IF(C24=\"\",0,LOOKUP(CONCATENATE(E24,\" \",C24),'CCNL 2019-2021'!$C$99:$C$130,'CCNL 2019-2021'!$J$99:$J$130))","v":0},{"$f":"IF(C24=\"\",0,LOOKUP(CONCATENATE(E24,\" \",C24),'VACANZA CONTR.LE'!$B$5:$B$300,'VACANZA CONTR.LE'!$J$5:$J$300))","v":0},0,113.04000000000087,7807.5799999999981,30914,null,650.63,null,"DIF",null,null,null,null,null,null,null,null,null,null,null,null,null,null,null,null,"2008-01-01","2008-12-31","A3F1 (C1)",20333.7,{"$f":"IF(C24=\"\",0,LOOKUP(CONCATENATE(E24,\" \",C24),'IND. AMM.NE'!$C$6:$C$166,'IND. AMM.NE'!$L$6:$L$166))","v":2772.72},2772.72,0,0,0,0,113.04000000000087,113.04000000000087,7807.5799999999981,7807.5799999999981,30914,30914,null,650.63,null,null,"2008-01-01",{"$f":"IF(C24=\"\",\"\",IF(ISNA(LOOKUP(BB24,RIFERIMENTI!$P$56:$P$70,RIFERIMENTI!$S$56:$S$70)),\"DIF\",LOOKUP(BB24,RIFERIMENTI!$P$56:$P$70,RIFERIMENTI!$S$56:$S$70)))","v":"DIF"},{"$f":"IF(BB24=\"\",\"\",IF(BC24=\"DIF\",0,VLOOKUP(E24,RIFERIMENTI!$H$2:$N$17,7,FALSE)))","v":0},null,{"$f":"IF(ISNA(VLOOKUP(BC24,'IND. AMM.NE'!$U$4:$V$26,2,FALSE)),\"DIFESA\",VLOOKUP(BC24,'IND. AMM.NE'!$U$4:$V$26,2,FALSE))","v":"DIFESA"},null,1]
[null,null,{"$f":"IF(RIFERIMENTI!$Q$31>0,\"\",RIFERIMENTI!AJ11)","v":"2009-01-01"},{"$f":"IF(RIFERIMENTI!$Q$31>0,\"\",RIFERIMENTI!AK11)","v":"2009-05-04"},{"$f":"IF(C25=\"\",\"\",IF(RIFERIMENTI!$Q$31=1,\"\",LOOKUP(C25,RIFERIMENTI!$V$49:$V$55,RIFERIMENTI!$W$49:$W$55)))","v":"A3F1 (C1)"},{"$f":"IF(C25=\"\",0,(LOOKUP(CONCATENATE(E25,\" \",C25),STIPENDIO!$B$5:$B$391,STIPENDIO!$H$5:$H$391))+(LOOKUP(CONCATENATE(E25,\" \",C25),'IND. INT. SPEC.'!$B$6:$B$39,'IND. INT. SPEC.'!$H$6:$H$39)))","v":21125.34},{"$f":"IF(C25=\"\",0,IF(BC25=\"DIF\",LOOKUP(CONCATENATE(E25,\" \",C25),'IND. AMM.NE'!$C$6:$C$166,'IND. AMM.NE'!$L$6:$L$166),VLOOKUP(CONCATENATE(BC25,\" \",BB25),'IND. AMM.NE'!$A$171:$X$253,BD25,TRUE)))","v":2772.72},{"$f":"IF(C25=\"\",0,LOOKUP(CONCATENATE(E25,\" \",C25),'CCNL 2019-2021'!$C$99:$C$130,'CCNL 2019-2021'!$J$99:$J$130))","v":0},{"$f":"IF(C25=\"\",0,LOOKUP(CONCATENATE(E25,\" \",C25),'VACANZA CONTR.LE'!$B$5:$B$300,'VACANZA CONTR.LE'!$J$5:$J$300))","v":0},0,791.63999999999942,7015.9399999999987,30914,null,584.66,null,"DIF",null,null,null,null,null,null,null,null,null,null,null,null,null,null,null,null,"2009-01-01","2009-05-04","A3F1 (C1)",21125.34,{"$f":"IF(C25=\"\",0,LOOKUP(CONCATENATE(E25,\" \",C25),'IND. AMM.NE'!$C$6:$C$166,'IND. AMM.NE'!$L$6:$L$166))","v":2772.72},2772.72,0,0,0,0,791.63999999999942,791.63999999999942,7015.9399999999987,7015.9399999999987,30914,30914,null,584.66,null,null,"2009-01-01",{"$f":"IF(C25=\"\",\"\",IF(ISNA(LOOKUP(BB25,RIFERIMENTI!$P$56:$P$70,RIFERIMENTI!$S$56:$S$70)),\"DIF\",LOOKUP(BB25,RIFERIMENTI!$P$56:$P$70,RIFERIMENTI!$S$56:$S$70)))","v":"DIF"},{"$f":"IF(BB25=\"\",\"\",IF(BC25=\"DIF\",0,VLOOKUP(E25,RIFERIMENTI!$H$2:$N$17,7,FALSE)))","v":0},null,{"$f":"IF(ISNA(VLOOKUP(BC25,'IND. AMM.NE'!$U$4:$V$26,2,FALSE)),\"DIFESA\",VLOOKUP(BC25,'IND. AMM.NE'!$U$4:$V$26,2,FALSE))","v":"DIFESA"},null,1]
[null,null,{"$f":"IF(RIFERIMENTI!$Q$31>0,\"\",RIFERIMENTI!AJ12)","v":"2009-05-05"},{"$f":"IF(RIFERIMENTI!$Q$31>0,\"\",RIFERIMENTI!AK12)","v":"2010-03-31"},{"$f":"IF(C26=\"\",\"\",IF(RIFERIMENTI!$Q$31=1,\"\",LOOKUP(C26,RIFERIMENTI!$V$49:$V$55,RIFERIMENTI!$W$49:$W$55)))","v":"A3F1 (C1)"},{"$f":"IF(C26=\"\",0,(LOOKUP(CONCATENATE(E26,\" \",C26),STIPENDIO!$B$5:$B$391,STIPENDIO!$H$5:$H$391))+(LOOKUP(CONCATENATE(E26,\" \",C26),'IND. INT. SPEC.'!$B$6:$B$39,'IND. INT. SPEC.'!$H$6:$H$39)))","v":21125.34},{"$f":"IF(C26=\"\",0,IF(BC26=\"DIF\",LOOKUP(CONCATENATE(E26,\" \",C26),'IND. AMM.NE'!$C$6:$C$166,'IND. AMM.NE'!$L$6:$L$166),VLOOKUP(CONCATENATE(BC26,\" \",BB26),'IND. AMM.NE'!$A$171:$X$253,BD26,TRUE)))","v":2772.72},{"$f":"IF(C26=\"\",0,LOOKUP(CONCATENATE(E26,\" \",C26),'CCNL 2019-2021'!$C$99:$C$130,'CCNL 2019-2021'!$J$99:$J$130))","v":0},{"$f":"IF(C26=\"\",0,LOOKUP(CONCATENATE(E26,\" \",C26),'VACANZA CONTR.LE'!$B$5:$B$300,'VACANZA CONTR.LE'!$J$5:$J$300))","v":0},0,0,7015.9399999999987,30914,null,584.66,null,"AMB",null,null,null,null,null,null,null,null,null,null,null,null,null,null,null,null,"2009-05-05","2010-03-31","A3F1 (C1)",21125.34,{"$f":"IF(C26=\"\",0,LOOKUP(CONCATENATE(E26,\" \",C26),'IND. AMM.NE'!$C$6:$C$166,'IND. AMM.NE'!$L$6:$L$166))","v":2772.72},2772.72,0,0,0,0,0,0,7015.9399999999987,7015.9399999999987,30914,30914,null,584.66,null,null,"2009-05-05",{"$f":"IF(C26=\"\",\"\",IF(ISNA(LOOKUP(BB26,RIFERIMENTI!$P$56:$P$70,RIFERIMENTI!$S$56:$S$70)),\"DIF\",LOOKUP(BB26,RIFERIMENTI!$P$56:$P$70,RIFERIMENTI!$S$56:$S$70)))","v":"AMB"},{"$f":"IF(BB26=\"\",\"\",IF(BC26=\"DIF\",0,VLOOKUP(E26,RIFERIMENTI!$H$2:$N$17,7,FALSE)))","v":15},null,{"$f":"IF(ISNA(VLOOKUP(BC26,'IND. AMM.NE'!$U$4:$V$26,2,FALSE)),\"DIFESA\",VLOOKUP(BC26,'IND. AMM.NE'!$U$4:$V$26,2,FALSE))","v":"TRANSIZIONE ECOLOGICA"},null,1]
[null,null,{"$f":"IF(RIFERIMENTI!$Q$31>0,\"\",RIFERIMENTI!AJ13)","v":"2010-04-01"},{"$f":"IF(RIFERIMENTI!$Q$31>0,\"\",RIFERIMENTI!AK13)","v":"2010-06-30"},{"$f":"IF(C27=\"\",\"\",IF(RIFERIMENTI!$Q$31=1,\"\",LOOKUP(C27,RIFERIMENTI!$V$49:$V$55,RIFERIMENTI!$W$49:$W$55)))","v":"A3F1 (C1)"},{"$f":"IF(C27=\"\",0,(LOOKUP(CONCATENATE(E27,\" \",C27),STIPENDIO!$B$5:$B$391,STIPENDIO!$H$5:$H$391))+(LOOKUP(CONCATENATE(E27,\" \",C27),'IND. INT. SPEC.'!$B$6:$B$39,'IND. INT. SPEC.'!$H$6:$H$39)))","v":21125.34},{"$f":"IF(C27=\"\",0,IF(BC27=\"DIF\",LOOKUP(CONCATENATE(E27,\" \",C27),'IND. AMM.NE'!$C$6:$C$166,'IND. AMM.NE'!$L$6:$L$166),VLOOKUP(CONCATENATE(BC27,\" \",BB27),'IND. AMM.NE'!$A$171:$X$253,BD27,TRUE)))","v":2772.72},{"$f":"IF(C27=\"\",0,LOOKUP(CONCATENATE(E27,\" \",C27),'CCNL 2019-2021'!$C$99:$C$130,'CCNL 2019-2021'!$J$99:$J$130))","v":0},{"$f":"IF(C27=\"\",0,LOOKUP(CONCATENATE(E27,\" \",C27),'VACANZA CONTR.LE'!$B$5:$B$300,'VACANZA CONTR.LE'!$J$5:$J$300))","v":95.04},0,95.040000000000873,6920.8999999999978,30914,null,576.74,null,"AMB",null,null,null,null,null,null,null,null,null,null,null,null,null,null,null,null,"2010-04-01","2010-06-30","A3F1 (C1)",21125.34,{"$f":"IF(C27=\"\",0,LOOKUP(CONCATENATE(E27,\" \",C27),'IND. AMM.NE'!$C$6:$C$166,'IND. AMM.NE'!$L$6:$L$166))","v":2772.72},2772.72,0,0,95.04,0,95.040000000000873,95.040000000000873,6920.8999999999978,6920.8999999999978,30914,30914,null,576.74,null,null,"2010-04-01",{"$f":"IF(C27=\"\",\"\",IF(ISNA(LOOKUP(BB27,RIFERIMENTI!$P$56:$P$70,RIFERIMENTI!$S$56:$S$70)),\"DIF\",LOOKUP(BB27,RIFERIMENTI!$P$56:$P$70,RIFERIMENTI!$S$56:$S$70)))","v":"AMB"},{"$f":"IF(BB27=\"\",\"\",IF(BC27=\"DIF\",0,VLOOKUP(E27,RIFERIMENTI!$H$2:$N$17,7,FALSE)))","v":15},null,{"$f":"IF(ISNA(VLOOKUP(BC27,'IND. AMM.NE'!$U$4:$V$26,2,FALSE)),\"DIFESA\",VLOOKUP(BC27,'IND. AMM.NE'!$U$4:$V$26,2,FALSE))","v":"TRANSIZIONE ECOLOGICA"},null,1]
[null,null,{"$f":"IF(RIFERIMENTI!$Q$31>0,\"\",RIFERIMENTI!AJ14)","v":"2010-07-01"},{"$f":"IF(RIFERIMENTI!$Q$31>0,\"\",RIFERIMENTI!AK14)","v":"2013-05-04"},{"$f":"IF(C28=\"\",\"\",IF(RIFERIMENTI!$Q$31=1,\"\",LOOKUP(C28,RIFERIMENTI!$V$49:$V$55,RIFERIMENTI!$W$49:$W$55)))","v":"A3F1 (C1)"},{"$f":"IF(C28=\"\",0,(LOOKUP(CONCATENATE(E28,\" \",C28),STIPENDIO!$B$5:$B$391,STIPENDIO!$H$5:$H$391))+(LOOKUP(CONCATENATE(E28,\" \",C28),'IND. INT. SPEC.'!$B$6:$B$39,'IND. INT. SPEC.'!$H$6:$H$39)))","v":21125.34},{"$f":"IF(C28=\"\",0,IF(BC28=\"DIF\",LOOKUP(CONCATENATE(E28,\" \",C28),'IND. AMM.NE'!$C$6:$C$166,'IND. AMM.NE'!$L$6:$L$166),VLOOKUP(CONCATENATE(BC28,\" \",BB28),'IND. AMM.NE'!$A$171:$X$253,BD28,TRUE)))","v":2772.72},{"$f":"IF(C28=\"\",0,LOOKUP(CONCATENATE(E28,\" \",C28),'CCNL 2019-2021'!$C$99:$C$130,'CCNL 2019-2021'!$J$99:$J$130))","v":0},{"$f":"IF(C28=\"\",0,LOOKUP(CONCATENATE(E28,\" \",C28),'VACANZA CONTR.LE'!$B$5:$B$300,'VACANZA CONTR.LE'!$J$5:$J$300))","v":158.44},0,63.399999999997817,6857.5,30914,null,571.46,null,"AMB",null,null,null,null,null,null,null,null,null,null,null,null,null,null,null,null,"2010-07-01","2013-05-04","A3F1 (C1)",21125.34,{"$f":"IF(C28=\"\",0,LOOKUP(CONCATENATE(E28,\" \",C28),'IND. AMM.NE'!$C$6:$C$166,'IND. AMM.NE'!$L$6:$L$166))","v":2772.72},2772.72,0,0,158.44,0,63.399999999997817,63.399999999997817,6857.5,6857.5,30914,30914,null,571.46,null,null,"2010-07-01",{"$f":"IF(C28=\"\",\"\",IF(ISNA(LOOKUP(BB28,RIFERIMENTI!$P$56:$P$70,RIFERIMENTI!$S$56:$S$70)),\"DIF\",LOOKUP(BB28,RIFERIMENTI!$P$56:$P$70,RIFERIMENTI!$S$56:$S$70)))","v":"AMB"},{"$f":"IF(BB28=\"\",\"\",IF(BC28=\"DIF\",0,VLOOKUP(E28,RIFERIMENTI!$H$2:$N$17,7,FALSE)))","v":15},null,{"$f":"IF(ISNA(VLOOKUP(BC28,'IND. AMM.NE'!$U$4:$V$26,2,FALSE)),\"DIFESA\",VLOOKUP(BC28,'IND. AMM.NE'!$U$4:$V$26,2,FALSE))","v":"TRANSIZIONE ECOLOGICA"},null,1,null,null,null," "]
[null,null,{"$f":"IF(RIFERIMENTI!$Q$31>0,\"\",RIFERIMENTI!AJ15)","v":"2013-05-05"},{"$f":"IF(RIFERIMENTI!$Q$31>0,\"\",RIFERIMENTI!AK15)","v":"2015-12-31"},{"$f":"IF(C29=\"\",\"\",IF(RIFERIMENTI!$Q$31=1,\"\",LOOKUP(C29,RIFERIMENTI!$V$49:$V$55,RIFERIMENTI!$W$49:$W$55)))","v":"A3F1 (C1)"},{"$f":"IF(C29=\"\",0,(LOOKUP(CONCATENATE(E29,\" \",C29),STIPENDIO!$B$5:$B$391,STIPENDIO!$H$5:$H$391))+(LOOKUP(CONCATENATE(E29,\" \",C29),'IND. INT. SPEC.'!$B$6:$B$39,'IND. INT. SPEC.'!$H$6:$H$39)))","v":21125.34},{"$f":"IF(C29=\"\",0,IF(BC29=\"DIF\",LOOKUP(CONCATENATE(E29,\" \",C29),'IND. AMM.NE'!$C$6:$C$166,'IND. AMM.NE'!$L$6:$L$166),VLOOKUP(CONCATENATE(BC29,\" \",BB29),'IND. AMM.NE'!$A$171:$X$253,BD29,TRUE)))","v":2772.72},{"$f":"IF(C29=\"\",0,LOOKUP(CONCATENATE(E29,\" \",C29),'CCNL 2019-2021'!$C$99:$C$130,'CCNL 2019-2021'!$J$99:$J$130))","v":0},{"$f":"IF(C29=\"\",0,LOOKUP(CONCATENATE(E29,\" \",C29),'VACANZA CONTR.LE'!$B$5:$B$300,'VACANZA CONTR.LE'!$J$5:$J$300))","v":158.44},0,0,6857.5,30914,null,571.46,null,"DIF",null,null,null,null,null,null,null,null,null,null,null,null,null,null,null,null,"2013-05-05","2015-12-31","A3F1 (C1)",21125.34,{"$f":"IF(C29=\"\",0,LOOKUP(CONCATENATE(E29,\" \",C29),'IND. AMM.NE'!$C$6:$C$166,'IND. AMM.NE'!$L$6:$L$166))","v":2772.72},2772.72,0,0,158.44,0,0,0,6857.5,6857.5,30914,30914,null,571.46,null,null,"2013-05-05",{"$f":"IF(C29=\"\",\"\",IF(ISNA(LOOKUP(BB29,RIFERIMENTI!$P$56:$P$70,RIFERIMENTI!$S$56:$S$70)),\"DIF\",LOOKUP(BB29,RIFERIMENTI!$P$56:$P$70,RIFERIMENTI!$S$56:$S$70)))","v":"DIF"},{"$f":"IF(BB29=\"\",\"\",IF(BC29=\"DIF\",0,VLOOKUP(E29,RIFERIMENTI!$H$2:$N$17,7,FALSE)))","v":0},null,{"$f":"IF(ISNA(VLOOKUP(BC29,'IND. AMM.NE'!$U$4:$V$26,2,FALSE)),\"DIFESA\",VLOOKUP(BC29,'IND. AMM.NE'!$U$4:$V$26,2,FALSE))","v":"DIFESA"},null,1]
[null,null,{"$f":"IF(RIFERIMENTI!$Q$31>0,\"\",RIFERIMENTI!AJ16)","v":"2016-01-01"},{"$f":"IF(RIFERIMENTI!$Q$31>0,\"\",RIFERIMENTI!AK16)","v":"2016-12-31"},{"$f":"IF(C30=\"\",\"\",IF(RIFERIMENTI!$Q$31=1,\"\",LOOKUP(C30,RIFERIMENTI!$V$49:$V$55,RIFERIMENTI!$W$49:$W$55)))","v":"A3F2 (C1S)"},{"$f":"IF(C30=\"\",0,(LOOKUP(CONCATENATE(E30,\" \",C30),STIPENDIO!$B$5:$B$391,STIPENDIO!$H$5:$H$391))+(LOOKUP(CONCATENATE(E30,\" \",C30),'IND. INT. SPEC.'!$B$6:$B$39,'IND. INT. SPEC.'!$H$6:$H$39)))","v":21982.9},{"$f":"IF(C30=\"\",0,IF(BC30=\"DIF\",LOOKUP(CONCATENATE(E30,\" \",C30),'IND. AMM.NE'!$C$6:$C$166,'IND. AMM.NE'!$L$6:$L$166),VLOOKUP(CONCATENATE(BC30,\" \",BB30),'IND. AMM.NE'!$A$171:$X$253,BD30,TRUE)))","v":2772.72},{"$f":"IF(C30=\"\",0,LOOKUP(CONCATENATE(E30,\" \",C30),'CCNL 2019-2021'!$C$99:$C$130,'CCNL 2019-2021'!$J$99:$J$130))","v":0},{"$f":"IF(C30=\"\",0,LOOKUP(CONCATENATE(E30,\" \",C30),'VACANZA CONTR.LE'!$B$5:$B$300,'VACANZA CONTR.LE'!$J$5:$J$300))","v":164.11},0,863.2300000000032,5994.2699999999968,30914,null,499.52,null,"DIF",null,null,null,null,null,null,null,null,null,null,null,null,null,null,null,null,"2016-01-01","2016-12-31","A3F2 (C1S)",21982.9,{"$f":"IF(C30=\"\",0,LOOKUP(CONCATENATE(E30,\" \",C30),'IND. AMM.NE'!$C$6:$C$166,'IND. AMM.NE'!$L$6:$L$166))","v":2772.72},2772.72,0,0,164.11,0,863.2300000000032,863.2300000000032,5994.2699999999968,5994.2699999999968,30914,30914,null,499.52,null,null,"2016-01-01",{"$f":"IF(C30=\"\",\"\",IF(ISNA(LOOKUP(BB30,RIFERIMENTI!$P$56:$P$70,RIFERIMENTI!$S$56:$S$70)),\"DIF\",LOOKUP(BB30,RIFERIMENTI!$P$56:$P$70,RIFERIMENTI!$S$56:$S$70)))","v":"DIF"},{"$f":"IF(BB30=\"\",\"\",IF(BC30=\"DIF\",0,VLOOKUP(E30,RIFERIMENTI!$H$2:$N$17,7,FALSE)))","v":0},null,{"$f":"IF(ISNA(VLOOKUP(BC30,'IND. AMM.NE'!$U$4:$V$26,2,FALSE)),\"DIFESA\",VLOOKUP(BC30,'IND. AMM.NE'!$U$4:$V$26,2,FALSE))","v":"DIFESA"},null,1]
[null,null,{"$f":"IF(RIFERIMENTI!$Q$31>0,\"\",RIFERIMENTI!AJ17)","v":"2017-01-01"},{"$f":"IF(RIFERIMENTI!$Q$31>0,\"\",RIFERIMENTI!AK17)","v":"2018-02-28"},{"$f":"IF(C31=\"\",\"\",IF(RIFERIMENTI!$Q$31=1,\"\",LOOKUP(C31,RIFERIMENTI!$V$49:$V$55,RIFERIMENTI!$W$49:$W$55)))","v":"A3F2 (C1S)"},{"$f":"IF(C31=\"\",0,(LOOKUP(CONCATENATE(E31,\" \",C31),STIPENDIO!$B$5:$B$391,STIPENDIO!$H$5:$H$391))+(LOOKUP(CONCATENATE(E31,\" \",C31),'IND. INT. SPEC.'!$B$6:$B$39,'IND. INT. SPEC.'!$H$6:$H$39)))","v":22188.1},{"$f":"IF(C31=\"\",0,IF(BC31=\"DIF\",LOOKUP(CONCATENATE(E31,\" \",C31),'IND. AMM.NE'!$C$6:$C$166,'IND. AMM.NE'!$L$6:$L$166),VLOOKUP(CONCATENATE(BC31,\" \",BB31),'IND. AMM.NE'!$A$171:$X$253,BD31,TRUE)))","v":2772.72},{"$f":"IF(C31=\"\",0,LOOKUP(CONCATENATE(E31,\" \",C31),'CCNL 2019-2021'!$C$99:$C$130,'CCNL 2019-2021'!$J$99:$J$130))","v":0},{"$f":"IF(C31=\"\",0,LOOKUP(CONCATENATE(E31,\" \",C31),'VACANZA CONTR.LE'!$B$5:$B$300,'VACANZA CONTR.LE'!$J$5:$J$300))","v":164.11},0,205.19999999999709,5789.07,{"$f":"F31+G31+H31+I31+J31+L31","v":30914},null,482.42,null,"DIF",null,null,null,null,null,null,null,null,null,null,null,null,null,null,null,null,"2017-01-01","2018-02-28","A3F2 (C1S)",22188.1,{"$f":"IF(C31=\"\",0,LOOKUP(CONCATENATE(E31,\" \",C31),'IND. AMM.NE'!$C$6:$C$166,'IND. AMM.NE'!$L$6:$L$166))","v":2772.72},2772.72,0,0,164.11,0,205.19999999999709,205.19999999999709,5789.07,5789.07,30914,30914,null,482.42,null,null,"2017-01-01",{"$f":"IF(C31=\"\",\"\",IF(ISNA(LOOKUP(BB31,RIFERIMENTI!$P$56:$P$70,RIFERIMENTI!$S$56:$S$70)),\"DIF\",LOOKUP(BB31,RIFERIMENTI!$P$56:$P$70,RIFERIMENTI!$S$56:$S$70)))","v":"DIF"},{"$f":"IF(BB31=\"\",\"\",IF(BC31=\"DIF\",0,VLOOKUP(E31,RIFERIMENTI!$H$2:$N$17,7,FALSE)))","v":0},null,{"$f":"IF(ISNA(VLOOKUP(BC31,'IND. AMM.NE'!$U$4:$V$26,2,FALSE)),\"DIFESA\",VLOOKUP(BC31,'IND. AMM.NE'!$U$4:$V$26,2,FALSE))","v":"DIFESA"},null,1]
[null,null,{"$f":"IF(RIFERIMENTI!$Q$31>0,\"\",RIFERIMENTI!AJ18)","v":"2018-03-01"},{"$f":"IF(RIFERIMENTI!$Q$31>0,\"\",RIFERIMENTI!AK18)","v":"2018-03-31"},{"$f":"IF(C32=\"\",\"\",IF(RIFERIMENTI!$Q$31=1,\"\",LOOKUP(C32,RIFERIMENTI!$V$49:$V$55,RIFERIMENTI!$W$49:$W$55)))","v":"A3F2 (C1S)"},{"$f":"IF(C32=\"\",0,(LOOKUP(CONCATENATE(E32,\" \",C32),STIPENDIO!$B$5:$B$391,STIPENDIO!$H$5:$H$391))+(LOOKUP(CONCATENATE(E32,\" \",C32),'IND. INT. SPEC.'!$B$6:$B$39,'IND. INT. SPEC.'!$H$6:$H$39)))","v":22910.5},{"$f":"IF(C32=\"\",0,IF(BC32=\"DIF\",LOOKUP(CONCATENATE(E32,\" \",C32),'IND. AMM.NE'!$C$6:$C$166,'IND. AMM.NE'!$L$6:$L$166),VLOOKUP(CONCATENATE(BC32,\" \",BB32),'IND. AMM.NE'!$A$171:$X$253,BD32,TRUE)))","v":2772.72},{"$f":"IF(C32=\"\",0,LOOKUP(CONCATENATE(E32,\" \",C32),'CCNL 2019-2021'!$C$99:$C$130,'CCNL 2019-2021'!$J$99:$J$130))","v":0},{"$f":"IF(C32=\"\",0,LOOKUP(CONCATENATE(E32,\" \",C32),'VACANZA CONTR.LE'!$B$5:$B$300,'VACANZA CONTR.LE'!$J$5:$J$300))","v":164.11},0,722.40000000000146,5066.6699999999983,{"$f":"F32+G32+H32+I32+J32+L32","v":30914},null,422.22,null,"DIF",null,null,null,null,null,null,null,null,null,null,null,null,null,null,null,null,"2018-03-01","2018-03-31","A3F2 (C1S)",22910.5,{"$f":"IF(C32=\"\",0,LOOKUP(CONCATENATE(E32,\" \",C32),'IND. AMM.NE'!$C$6:$C$166,'IND. AMM.NE'!$L$6:$L$166))","v":2772.72},2772.72,0,0,164.11,0,722.40000000000146,722.40000000000146,5066.6699999999983,5066.6699999999983,30914,30914,null,422.22,null,null,"2018-03-01",{"$f":"IF(C32=\"\",\"\",IF(ISNA(LOOKUP(BB32,RIFERIMENTI!$P$56:$P$70,RIFERIMENTI!$S$56:$S$70)),\"DIF\",LOOKUP(BB32,RIFERIMENTI!$P$56:$P$70,RIFERIMENTI!$S$56:$S$70)))","v":"DIF"},{"$f":"IF(BB32=\"\",\"\",IF(BC32=\"DIF\",0,VLOOKUP(E32,RIFERIMENTI!$H$2:$N$17,7,FALSE)))","v":0},null,{"$f":"IF(ISNA(VLOOKUP(BC32,'IND. AMM.NE'!$U$4:$V$26,2,FALSE)),\"DIFESA\",VLOOKUP(BC32,'IND. AMM.NE'!$U$4:$V$26,2,FALSE))","v":"DIFESA"},null,1]
[null,null,{"$f":"IF(RIFERIMENTI!$Q$31>0,\"\",RIFERIMENTI!AJ19)","v":"2018-04-01"},{"$f":"IF(RIFERIMENTI!$Q$31>0,\"\",RIFERIMENTI!AK19)","v":"2018-12-31"},{"$f":"IF(C33=\"\",\"\",IF(RIFERIMENTI!$Q$31=1,\"\",LOOKUP(C33,RIFERIMENTI!$V$49:$V$55,RIFERIMENTI!$W$49:$W$55)))","v":"A3F2 (C1S)"},{"$f":"IF(C33=\"\",0,(LOOKUP(CONCATENATE(E33,\" \",C33),STIPENDIO!$B$5:$B$391,STIPENDIO!$H$5:$H$391))+(LOOKUP(CONCATENATE(E33,\" \",C33),'IND. INT. SPEC.'!$B$6:$B$39,'IND. INT. SPEC.'!$H$6:$H$39)))","v":23074.61},{"$f":"IF(C33=\"\",0,IF(BC33=\"DIF\",LOOKUP(CONCATENATE(E33,\" \",C33),'IND. AMM.NE'!$C$6:$C$166,'IND. AMM.NE'!$L$6:$L$166),VLOOKUP(CONCATENATE(BC33,\" \",BB33),'IND. AMM.NE'!$A$171:$X$253,BD33,TRUE)))","v":2772.72},{"$f":"IF(C33=\"\",0,LOOKUP(CONCATENATE(E33,\" \",C33),'CCNL 2019-2021'!$C$99:$C$130,'CCNL 2019-2021'!$J$99:$J$130))","v":0},{"$f":"IF(C33=\"\",0,LOOKUP(CONCATENATE(E33,\" \",C33),'VACANZA CONTR.LE'!$B$5:$B$300,'VACANZA CONTR.LE'!$J$5:$J$300))","v":0},0,0,5066.6699999999983,30914,null,422.22,null,"DIF",null,null,null,null,null,null,null,null,null,null,null,null,null,null,null,null,"2018-04-01","2018-12-31","A3F2 (C1S)",23074.61,{"$f":"IF(C33=\"\",0,LOOKUP(CONCATENATE(E33,\" \",C33),'IND. AMM.NE'!$C$6:$C$166,'IND. AMM.NE'!$L$6:$L$166))","v":2772.72},2772.72,0,0,0,0,0,0,5066.6699999999983,5066.6699999999983,30914,30914,null,422.22,null,null,"2018-04-01",{"$f":"IF(C33=\"\",\"\",IF(ISNA(LOOKUP(BB33,RIFERIMENTI!$P$56:$P$70,RIFERIMENTI!$S$56:$S$70)),\"DIF\",LOOKUP(BB33,RIFERIMENTI!$P$56:$P$70,RIFERIMENTI!$S$56:$S$70)))","v":"DIF"},{"$f":"IF(BB33=\"\",\"\",IF(BC33=\"DIF\",0,VLOOKUP(E33,RIFERIMENTI!$H$2:$N$17,7,FALSE)))","v":0},null,{"$f":"IF(ISNA(VLOOKUP(BC33,'IND. AMM.NE'!$U$4:$V$26,2,FALSE)),\"DIFESA\",VLOOKUP(BC33,'IND. AMM.NE'!$U$4:$V$26,2,FALSE))","v":"DIFESA"},null,1]
[null,null,{"$f":"IF(RIFERIMENTI!$Q$31>0,\"\",RIFERIMENTI!AJ20)","v":"2019-01-01"},{"$f":"IF(RIFERIMENTI!$Q$31>0,\"\",RIFERIMENTI!AK20)","v":"2019-12-31"},{"$f":"IF(C34=\"\",\"\",IF(RIFERIMENTI!$Q$31=1,\"\",LOOKUP(C34,RIFERIMENTI!$V$49:$V$55,RIFERIMENTI!$W$49:$W$55)))","v":"A3F2 (C1S)"},{"$f":"IF(C34=\"\",0,(LOOKUP(CONCATENATE(E34,\" \",C34),STIPENDIO!$B$5:$B$391,STIPENDIO!$H$5:$H$391))+(LOOKUP(CONCATENATE(E34,\" \",C34),'IND. INT. SPEC.'!$B$6:$B$39,'IND. INT. SPEC.'!$H$6:$H$39)))","v":23279.81},{"$f":"IF(C34=\"\",0,IF(BC34=\"DIF\",LOOKUP(CONCATENATE(E34,\" \",C34),'IND. AMM.NE'!$C$6:$C$166,'IND. AMM.NE'!$L$6:$L$166),VLOOKUP(CONCATENATE(BC34,\" \",BB34),'IND. AMM.NE'!$A$171:$X$253,BD34,TRUE)))","v":2772.72},{"$f":"IF(C34=\"\",0,LOOKUP(CONCATENATE(E34,\" \",C34),'CCNL 2019-2021'!$C$99:$C$130,'CCNL 2019-2021'!$J$99:$J$130))","v":0},{"$f":"IF(C34=\"\",0,LOOKUP(CONCATENATE(E34,\" \",C34),'VACANZA CONTR.LE'!$B$5:$B$300,'VACANZA CONTR.LE'!$J$5:$J$300))","v":0},0,205.20000000000073,4861.4699999999975,30914,null,405.12,null,"DIF",null,null,null,null,null,null,null,null,null,null,null,null,null,null,null,null,"2019-01-01","2019-12-31","A3F2 (C1S)",23279.81,{"$f":"IF(C34=\"\",0,LOOKUP(CONCATENATE(E34,\" \",C34),'IND. AMM.NE'!$C$6:$C$166,'IND. AMM.NE'!$L$6:$L$166))","v":2772.72},2772.72,0,0,0,0,205.20000000000073,205.20000000000073,4861.4699999999975,4861.4699999999975,30914,30914,null,405.12,null,null,"2019-01-01",{"$f":"IF(C34=\"\",\"\",IF(ISNA(LOOKUP(BB34,RIFERIMENTI!$P$56:$P$70,RIFERIMENTI!$S$56:$S$70)),\"DIF\",LOOKUP(BB34,RIFERIMENTI!$P$56:$P$70,RIFERIMENTI!$S$56:$S$70)))","v":"DIF"},{"$f":"IF(BB34=\"\",\"\",IF(BC34=\"DIF\",0,VLOOKUP(E34,RIFERIMENTI!$H$2:$N$17,7,FALSE)))","v":0},null,{"$f":"IF(ISNA(VLOOKUP(BC34,'IND. AMM.NE'!$U$4:$V$26,2,FALSE)),\"DIFESA\",VLOOKUP(BC34,'IND. AMM.NE'!$U$4:$V$26,2,FALSE))","v":"DIFESA"},null,1]
[null,null,{"$f":"IF(RIFERIMENTI!$Q$31>0,\"\",RIFERIMENTI!AJ21)","v":"2020-01-01"},{"$f":"IF(RIFERIMENTI!$Q$31>0,\"\",RIFERIMENTI!AK21)","v":"2020-12-31"},{"$f":"IF(C35=\"\",\"\",IF(RIFERIMENTI!$Q$31=1,\"\",LOOKUP(C35,RIFERIMENTI!$V$49:$V$55,RIFERIMENTI!$W$49:$W$55)))","v":"A3F2 (C1S)"},{"$f":"IF(C35=\"\",0,(LOOKUP(CONCATENATE(E35,\" \",C35),STIPENDIO!$B$5:$B$391,STIPENDIO!$H$5:$H$391))+(LOOKUP(CONCATENATE(E35,\" \",C35),'IND. INT. SPEC.'!$B$6:$B$39,'IND. INT. SPEC.'!$H$6:$H$39)))","v":23489.81},{"$f":"IF(C35=\"\",0,IF(BC35=\"DIF\",LOOKUP(CONCATENATE(E35,\" \",C35),'IND. AMM.NE'!$C$6:$C$166,'IND. AMM.NE'!$L$6:$L$166),VLOOKUP(CONCATENATE(BC35,\" \",BB35),'IND. AMM.NE'!$A$171:$X$253,BD35,TRUE)))","v":4047.72},{"$f":"IF(C35=\"\",0,LOOKUP(CONCATENATE(E35,\" \",C35),'CCNL 2019-2021'!$C$99:$C$130,'CCNL 2019-2021'!$J$99:$J$130))","v":0},{"$f":"IF(C35=\"\",0,LOOKUP(CONCATENATE(E35,\" \",C35),'VACANZA CONTR.LE'!$B$5:$B$300,'VACANZA CONTR.LE'!$J$5:$J$300))","v":0},0,1485,3376.4699999999975,30914,null,281.37,null,"DIF",null,null,null,null,null,null,null,null,null,null,null,null,null,null,null,null,"2020-01-01","2020-12-31","A3F2 (C1S)",23489.81,{"$f":"IF(C35=\"\",0,LOOKUP(CONCATENATE(E35,\" \",C35),'IND. AMM.NE'!$C$6:$C$166,'IND. AMM.NE'!$L$6:$L$166))","v":4047.72},4047.72,0,0,0,0,1485,1485,3376.4699999999975,3376.4699999999975,30914,30914,null,281.37,null,null,"2020-01-01",{"$f":"IF(C35=\"\",\"\",IF(ISNA(LOOKUP(BB35,RIFERIMENTI!$P$56:$P$70,RIFERIMENTI!$S$56:$S$70)),\"DIF\",LOOKUP(BB35,RIFERIMENTI!$P$56:$P$70,RIFERIMENTI!$S$56:$S$70)))","v":"DIF"},{"$f":"IF(BB35=\"\",\"\",IF(BC35=\"DIF\",0,VLOOKUP(E35,RIFERIMENTI!$H$2:$N$17,7,FALSE)))","v":0},null,{"$f":"IF(ISNA(VLOOKUP(BC35,'IND. AMM.NE'!$U$4:$V$26,2,FALSE)),\"DIFESA\",VLOOKUP(BC35,'IND. AMM.NE'!$U$4:$V$26,2,FALSE))","v":"DIFESA"},null,1]
[null,null,{"$f":"IF(RIFERIMENTI!$Q$31>0,\"\",RIFERIMENTI!AJ22)","v":"2021-01-01"},{"$f":"IF(RIFERIMENTI!$Q$31>0,\"\",RIFERIMENTI!AK22)","v":"2022-03-31"},{"$f":"IF(C36=\"\",\"\",IF(RIFERIMENTI!$Q$31=1,\"\",LOOKUP(C36,RIFERIMENTI!$V$49:$V$55,RIFERIMENTI!$W$49:$W$55)))","v":"A3F3 (C2)"},{"$f":"IF(C36=\"\",0,(LOOKUP(CONCATENATE(E36,\" \",C36),STIPENDIO!$B$5:$B$391,STIPENDIO!$H$5:$H$391))+(LOOKUP(CONCATENATE(E36,\" \",C36),'IND. INT. SPEC.'!$B$6:$B$39,'IND. INT. SPEC.'!$H$6:$H$39)))","v":25373.64},{"$f":"IF(C36=\"\",0,IF(BC36=\"DIF\",LOOKUP(CONCATENATE(E36,\" \",C36),'IND. AMM.NE'!$C$6:$C$166,'IND. AMM.NE'!$L$6:$L$166),VLOOKUP(CONCATENATE(BC36,\" \",BB36),'IND. AMM.NE'!$A$171:$X$253,BD36,TRUE)))","v":5467.5599999999995},{"$f":"IF(C36=\"\",0,LOOKUP(CONCATENATE(E36,\" \",C36),'CCNL 2019-2021'!$C$99:$C$130,'CCNL 2019-2021'!$J$99:$J$130))","v":0},{"$f":"IF(C36=\"\",0,LOOKUP(CONCATENATE(E36,\" \",C36),'VACANZA CONTR.LE'!$B$5:$B$300,'VACANZA CONTR.LE'!$J$5:$J$300))","v":0},0,3303.6699999999946,72.80000000000291,30914,null,6.07,null,"DIF",null,null,null,null,null,null,null,null,null,null,null,null,null,null,null,null,"2021-01-01","2022-03-31","A3F3 (C2)",25373.64,{"$f":"IF(C36=\"\",0,LOOKUP(CONCATENATE(E36,\" \",C36),'IND. AMM.NE'!$C$6:$C$166,'IND. AMM.NE'!$L$6:$L$166))","v":5467.5599999999995},5467.5599999999995,0,0,0,0,3303.6699999999946,3303.6699999999946,72.80000000000291,72.80000000000291,30914,30914,null,6.07,null,null,"2021-01-01",{"$f":"IF(C36=\"\",\"\",IF(ISNA(LOOKUP(BB36,RIFERIMENTI!$P$56:$P$70,RIFERIMENTI!$S$56:$S$70)),\"DIF\",LOOKUP(BB36,RIFERIMENTI!$P$56:$P$70,RIFERIMENTI!$S$56:$S$70)))","v":"DIF"},{"$f":"IF(BB36=\"\",\"\",IF(BC36=\"DIF\",0,VLOOKUP(E36,RIFERIMENTI!$H$2:$N$17,7,FALSE)))","v":0},null,{"$f":"IF(ISNA(VLOOKUP(BC36,'IND. AMM.NE'!$U$4:$V$26,2,FALSE)),\"DIFESA\",VLOOKUP(BC36,'IND. AMM.NE'!$U$4:$V$26,2,FALSE))","v":"DIFESA"},null,1]
[null,null,{"$f":"IF(RIFERIMENTI!$Q$31>0,\"\",RIFERIMENTI!AJ23)","v":"2022-04-01"},{"$f":"IF(RIFERIMENTI!$Q$31>0,\"\",RIFERIMENTI!AK23)","v":"2022-06-30"},{"$f":"IF(C37=\"\",\"\",IF(RIFERIMENTI!$Q$31=1,\"\",LOOKUP(C37,RIFERIMENTI!$V$49:$V$55,RIFERIMENTI!$W$49:$W$55)))","v":"A3F3 (C2)"},{"$f":"IF(C37=\"\",0,(LOOKUP(CONCATENATE(E37,\" \",C37),STIPENDIO!$B$5:$B$391,STIPENDIO!$H$5:$H$391))+(LOOKUP(CONCATENATE(E37,\" \",C37),'IND. INT. SPEC.'!$B$6:$B$39,'IND. INT. SPEC.'!$H$6:$H$39)))","v":25373.64},{"$f":"IF(C37=\"\",0,IF(BC37=\"DIF\",LOOKUP(CONCATENATE(E37,\" \",C37),'IND. AMM.NE'!$C$6:$C$166,'IND. AMM.NE'!$L$6:$L$166),VLOOKUP(CONCATENATE(BC37,\" \",BB37),'IND. AMM.NE'!$A$171:$X$253,BD37,TRUE)))","v":5467.5599999999995},{"$f":"IF(C37=\"\",0,LOOKUP(CONCATENATE(E37,\" \",C37),'CCNL 2019-2021'!$C$99:$C$130,'CCNL 2019-2021'!$J$99:$J$130))","v":0},{"$f":"IF(C37=\"\",0,LOOKUP(CONCATENATE(E37,\" \",C37),'VACANZA CONTR.LE'!$B$5:$B$300,'VACANZA CONTR.LE'!$J$5:$J$300))","v":76.12},0,76.119999999998981,0,30917.319999999996,null,0,null,"DIF",null,null,null,null,null,null,null,null,null,null,null,null,null,null,null,null,"2022-04-01","2022-06-30","A3F3 (C2)",25373.64,{"$f":"IF(C37=\"\",0,LOOKUP(CONCATENATE(E37,\" \",C37),'IND. AMM.NE'!$C$6:$C$166,'IND. AMM.NE'!$L$6:$L$166))","v":5467.5599999999995},5467.5599999999995,0,0,76.12,0,76.119999999998981,76.119999999998981,0,0,30917.319999999996,30917.319999999996,null,0,null,null,"2022-04-01",{"$f":"IF(C37=\"\",\"\",IF(ISNA(LOOKUP(BB37,RIFERIMENTI!$P$56:$P$70,RIFERIMENTI!$S$56:$S$70)),\"DIF\",LOOKUP(BB37,RIFERIMENTI!$P$56:$P$70,RIFERIMENTI!$S$56:$S$70)))","v":"DIF"},{"$f":"IF(BB37=\"\",\"\",IF(BC37=\"DIF\",0,VLOOKUP(E37,RIFERIMENTI!$H$2:$N$17,7,FALSE)))","v":0},null,{"$f":"IF(ISNA(VLOOKUP(BC37,'IND. AMM.NE'!$U$4:$V$26,2,FALSE)),\"DIFESA\",VLOOKUP(BC37,'IND. AMM.NE'!$U$4:$V$26,2,FALSE))","v":"DIFESA"},null,1]
[null,null,{"$f":"IF(RIFERIMENTI!$Q$31>0,\"\",RIFERIMENTI!AJ24)","v":"2022-07-01"},{"$f":"IF(RIFERIMENTI!$Q$31>0,\"\",RIFERIMENTI!AK24)","v":"2022-10-31"},{"$f":"IF(C38=\"\",\"\",IF(RIFERIMENTI!$Q$31=1,\"\",LOOKUP(C38,RIFERIMENTI!$V$49:$V$55,RIFERIMENTI!$W$49:$W$55)))","v":"A3F3 (C2)"},{"$f":"IF(C38=\"\",0,(LOOKUP(CONCATENATE(E38,\" \",C38),STIPENDIO!$B$5:$B$391,STIPENDIO!$H$5:$H$391))+(LOOKUP(CONCATENATE(E38,\" \",C38),'IND. INT. SPEC.'!$B$6:$B$39,'IND. INT. SPEC.'!$H$6:$H$39)))","v":25373.64},{"$f":"IF(C38=\"\",0,IF(BC38=\"DIF\",LOOKUP(CONCATENATE(E38,\" \",C38),'IND. AMM.NE'!$C$6:$C$166,'IND. AMM.NE'!$L$6:$L$166),VLOOKUP(CONCATENATE(BC38,\" \",BB38),'IND. AMM.NE'!$A$171:$X$253,BD38,TRUE)))","v":5467.5599999999995},{"$f":"IF(C38=\"\",0,LOOKUP(CONCATENATE(E38,\" \",C38),'CCNL 2019-2021'!$C$99:$C$130,'CCNL 2019-2021'!$J$99:$J$130))","v":0},{"$f":"IF(C38=\"\",0,LOOKUP(CONCATENATE(E38,\" \",C38),'VACANZA CONTR.LE'!$B$5:$B$300,'VACANZA CONTR.LE'!$J$5:$J$300))","v":126.87},0,50.75,0,30968.069999999996,null,0,null,"DIF",null,null,null,null,null,null,null,null,null,null,null,null,null,null,null,null,"2022-07-01","2022-10-31","A3F3 (C2)",25373.64,{"$f":"IF(C38=\"\",0,LOOKUP(CONCATENATE(E38,\" \",C38),'IND. AMM.NE'!$C$6:$C$166,'IND. AMM.NE'!$L$6:$L$166))","v":5467.5599999999995},5467.5599999999995,0,0,126.87,0,50.75,50.75,0,0,30968.069999999996,30968.069999999996,null,0,null,null,"2022-07-01",{"$f":"IF(C38=\"\",\"\",IF(ISNA(LOOKUP(BB38,RIFERIMENTI!$P$56:$P$70,RIFERIMENTI!$S$56:$S$70)),\"DIF\",LOOKUP(BB38,RIFERIMENTI!$P$56:$P$70,RIFERIMENTI!$S$56:$S$70)))","v":"DIF"},{"$f":"IF(BB38=\"\",\"\",IF(BC38=\"DIF\",0,VLOOKUP(E38,RIFERIMENTI!$H$2:$N$17,7,FALSE)))","v":0},null,{"$f":"IF(ISNA(VLOOKUP(BC38,'IND. AMM.NE'!$U$4:$V$26,2,FALSE)),\"DIFESA\",VLOOKUP(BC38,'IND. AMM.NE'!$U$4:$V$26,2,FALSE))","v":"DIFESA"},null,1,null,null,null,null," "]
[null,null,{"$f":"IF(RIFERIMENTI!$Q$31>0,\"\",RIFERIMENTI!AJ25)","v":"2022-11-01"},{"$f":"IF(RIFERIMENTI!$Q$31>0,\"\",RIFERIMENTI!AK25)","v":"2023-12-31"},{"$f":"IF(C39=\"\",\"\",IF(RIFERIMENTI!$Q$31=1,\"\",LOOKUP(C39,RIFERIMENTI!$V$49:$V$55,RIFERIMENTI!$W$49:$W$55)))","v":"A3F3 (C2)"},{"$f":"IF(C39=\"\",0,(LOOKUP(CONCATENATE(E39,\" \",C39),STIPENDIO!$B$5:$B$391,STIPENDIO!$H$5:$H$391))+(LOOKUP(CONCATENATE(E39,\" \",C39),'IND. INT. SPEC.'!$B$6:$B$39,'IND. INT. SPEC.'!$H$6:$H$39)))","v":23501.879999999997},{"$f":"IF(C39=\"\",0,IF(BC39=\"DIF\",LOOKUP(CONCATENATE(E39,\" \",C39),'IND. AMM.NE'!$C$6:$C$166,'IND. AMM.NE'!$L$6:$L$166),VLOOKUP(CONCATENATE(BC39,\" \",BB39),'IND. AMM.NE'!$A$171:$X$253,BD39,TRUE)))","v":4638},{"$f":"IF(C39=\"\",0,LOOKUP(CONCATENATE(E39,\" \",C39),'CCNL 2019-2021'!$C$99:$C$130,'CCNL 2019-2021'!$J$99:$J$130))","v":2637.48},{"$f":"IF(C39=\"\",0,LOOKUP(CONCATENATE(E39,\" \",C39),'VACANZA CONTR.LE'!$B$5:$B$300,'VACANZA CONTR.LE'!$J$5:$J$300))","v":126.87},0,-63.840000000000146,9.7700000000040745,30914,null,0.81,null,"DIF",null,null,null,null,null,null,null,null,null,null,null,null,null,null,null,null,"2022-11-01","2023-12-31","A3F3 (C2)",23501.879999999997,{"$f":"IF(C39=\"\",0,LOOKUP(CONCATENATE(E39,\" \",C39),'IND. AMM.NE'!$C$6:$C$166,'IND. AMM.NE'!$L$6:$L$166))","v":4638},4638,0,2637.48,126.87,0,-63.840000000000146,-63.840000000000146,9.7700000000040745,9.7700000000040745,30914,30914,null,0.81,null,null,"2022-11-01",{"$f":"IF(C39=\"\",\"\",IF(ISNA(LOOKUP(BB39,RIFERIMENTI!$P$56:$P$70,RIFERIMENTI!$S$56:$S$70)),\"DIF\",LOOKUP(BB39,RIFERIMENTI!$P$56:$P$70,RIFERIMENTI!$S$56:$S$70)))","v":"DIF"},{"$f":"IF(BB39=\"\",\"\",IF(BC39=\"DIF\",0,VLOOKUP(E39,RIFERIMENTI!$H$2:$N$17,7,FALSE)))","v":0},null,{"$f":"IF(ISNA(VLOOKUP(BC39,'IND. AMM.NE'!$U$4:$V$26,2,FALSE)),\"DIFESA\",VLOOKUP(BC39,'IND. AMM.NE'!$U$4:$V$26,2,FALSE))","v":"DIFESA"},null,1,null,null,null,null,null," "]
[null,null,{"$f":"IF(RIFERIMENTI!$Q$31>0,\"\",RIFERIMENTI!AJ26)","v":"2024-01-01"},{"$f":"IF(RIFERIMENTI!$Q$31>0,\"\",RIFERIMENTI!AK26)","v":"9999-12-31"},{"$f":"IF(C40=\"\",\"\",IF(RIFERIMENTI!$Q$31=1,\"\",LOOKUP(C40,RIFERIMENTI!$V$49:$V$55,RIFERIMENTI!$W$49:$W$55)))","v":"A3F3 (C2)"},{"$f":"IF(C40=\"\",0,(LOOKUP(CONCATENATE(E40,\" \",C40),STIPENDIO!$B$5:$B$391,STIPENDIO!$H$5:$H$391))+(LOOKUP(CONCATENATE(E40,\" \",C40),'IND. INT. SPEC.'!$B$6:$B$39,'IND. INT. SPEC.'!$H$6:$H$39)))","v":23501.879999999997},{"$f":"IF(C40=\"\",0,IF(BC40=\"DIF\",LOOKUP(CONCATENATE(E40,\" \",C40),'IND. AMM.NE'!$C$6:$C$166,'IND. AMM.NE'!$L$6:$L$166),VLOOKUP(CONCATENATE(BC40,\" \",BB40),'IND. AMM.NE'!$A$171:$X$253,BD40,TRUE)))","v":4638},{"$f":"IF(C40=\"\",0,LOOKUP(CONCATENATE(E40,\" \",C40),'CCNL 2019-2021'!$C$99:$C$130,'CCNL 2019-2021'!$J$99:$J$130))","v":2637.48},{"$f":"IF(C40=\"\",0,LOOKUP(CONCATENATE(E40,\" \",C40),'VACANZA CONTR.LE'!$B$5:$B$300,'VACANZA CONTR.LE'!$J$5:$J$300))","v":976.7},0,849.83000000000175,0,31754.059999999998," ",0,null,"DIF",null,null,null,null,null,null,null,null,null,null,null,null,null,null,null,null,"2024-01-01","9999-12-31","A3F3 (C2)",23501.879999999997,{"$f":"IF(C40=\"\",0,LOOKUP(CONCATENATE(E40,\" \",C40),'IND. AMM.NE'!$C$6:$C$166,'IND. AMM.NE'!$L$6:$L$166))","v":4638},4638,0,2637.48,976.7,0,849.83000000000175,849.83000000000175,0,0,31754.059999999998,31754.059999999998,null,0,null,null,"2024-01-01",{"$f":"IF(C40=\"\",\"\",IF(ISNA(LOOKUP(BB40,RIFERIMENTI!$P$56:$P$70,RIFERIMENTI!$S$56:$S$70)),\"DIF\",LOOKUP(BB40,RIFERIMENTI!$P$56:$P$70,RIFERIMENTI!$S$56:$S$70)))","v":"DIF"},{"$f":"IF(BB40=\"\",\"\",IF(BC40=\"DIF\",0,VLOOKUP(E40,RIFERIMENTI!$H$2:$N$17,7,FALSE)))","v":0},null,{"$f":"IF(ISNA(VLOOKUP(BC40,'IND. AMM.NE'!$U$4:$V$26,2,FALSE)),\"DIFESA\",VLOOKUP(BC40,'IND. AMM.NE'!$U$4:$V$26,2,FALSE))","v":"DIFESA"},null,1]
[null,null,{"$f":"IF(RIFERIMENTI!$Q$31>0,\"\",RIFERIMENTI!AJ27)","v":""},{"$f":"IF(RIFERIMENTI!$Q$31>0,\"\",RIFERIMENTI!AK27)","v":""},{"$f":"IF(C41=\"\",\"\",IF(RIFERIMENTI!$Q$31=1,\"\",LOOKUP(C41,RIFERIMENTI!$V$49:$V$55,RIFERIMENTI!$W$49:$W$55)))","v":""},{"$f":"IF(C41=\"\",0,(LOOKUP(CONCATENATE(E41,\" \",C41),STIPENDIO!$B$5:$B$391,STIPENDIO!$H$5:$H$391))+(LOOKUP(CONCATENATE(E41,\" \",C41),'IND. INT. SPEC.'!$B$6:$B$39,'IND. INT. SPEC.'!$H$6:$H$39)))","v":0},{"$f":"IF(C41=\"\",0,IF(BC41=\"DIF\",LOOKUP(CONCATENATE(E41,\" \",C41),'IND. AMM.NE'!$C$6:$C$166,'IND. AMM.NE'!$L$6:$L$166),VLOOKUP(CONCATENATE(BC41,\" \",BB41),'IND. AMM.NE'!$A$171:$X$253,BD41,TRUE)))","v":0},{"$f":"IF(C41=\"\",0,LOOKUP(CONCATENATE(E41,\" \",C41),'CCNL 2019-2021'!$C$99:$C$130,'CCNL 2019-2021'!$J$99:$J$130))","v":0},{"$f":"IF(C41=\"\",0,LOOKUP(CONCATENATE(E41,\" \",C41),'VACANZA CONTR.LE'!$B$5:$B$300,'VACANZA CONTR.LE'!$J$5:$J$300))","v":0},0,0,0,0,null,0,null,"",null,null,null,null,null,null,null,null,null,null,null,null,null,null,null,null,"","","",0,{"$f":"IF(C41=\"\",0,LOOKUP(CONCATENATE(E41,\" \",C41),'IND. AMM.NE'!$C$6:$C$166,'IND. AMM.NE'!$L$6:$L$166))","v":0},0,0,0,0,0,0,0,0,0,0,0,null,0,null,null,"",{"$f":"IF(C41=\"\",\"\",IF(ISNA(LOOKUP(BB41,RIFERIMENTI!$P$56:$P$70,RIFERIMENTI!$S$56:$S$70)),\"DIF\",LOOKUP(BB41,RIFERIMENTI!$P$56:$P$70,RIFERIMENTI!$S$56:$S$70)))","v":""},{"$f":"IF(BB41=\"\",\"\",IF(BC41=\"DIF\",0,VLOOKUP(E41,RIFERIMENTI!$H$2:$N$17,7,FALSE)))","v":""},null,{"$f":"IF(ISNA(VLOOKUP(BC41,'IND. AMM.NE'!$U$4:$V$26,2,FALSE)),\"DIFESA\",VLOOKUP(BC41,'IND. AMM.NE'!$U$4:$V$26,2,FALSE))","v":"DIFESA"},null,0]
[null,null,{"$f":"IF(RIFERIMENTI!$Q$31>0,\"\",RIFERIMENTI!AJ28)","v":""},{"$f":"IF(RIFERIMENTI!$Q$31>0,\"\",RIFERIMENTI!AK28)","v":""},{"$f":"IF(C42=\"\",\"\",IF(RIFERIMENTI!$Q$31=1,\"\",LOOKUP(C42,RIFERIMENTI!$V$49:$V$55,RIFERIMENTI!$W$49:$W$55)))","v":""},{"$f":"IF(C42=\"\",0,(LOOKUP(CONCATENATE(E42,\" \",C42),STIPENDIO!$B$5:$B$391,STIPENDIO!$H$5:$H$391))+(LOOKUP(CONCATENATE(E42,\" \",C42),'IND. INT. SPEC.'!$B$6:$B$39,'IND. INT. SPEC.'!$H$6:$H$39)))","v":0},{"$f":"IF(C42=\"\",0,IF(BC42=\"DIF\",LOOKUP(CONCATENATE(E42,\" \",C42),'IND. AMM.NE'!$C$6:$C$166,'IND. AMM.NE'!$L$6:$L$166),VLOOKUP(CONCATENATE(BC42,\" \",BB42),'IND. AMM.NE'!$A$171:$X$253,BD42,TRUE)))","v":0},{"$f":"IF(C42=\"\",0,LOOKUP(CONCATENATE(E42,\" \",C42),'CCNL 2019-2021'!$C$99:$C$130,'CCNL 2019-2021'!$J$99:$J$130))","v":0},{"$f":"IF(C42=\"\",0,LOOKUP(CONCATENATE(E42,\" \",C42),'VACANZA CONTR.LE'!$B$5:$B$300,'VACANZA CONTR.LE'!$J$5:$J$300))","v":0},0,0,0,0,null,0,null,"",null,null,null,null,null,null,null,null,null,null,null,null,null,null,null,null,"","","",0,{"$f":"IF(C42=\"\",0,LOOKUP(CONCATENATE(E42,\" \",C42),'IND. AMM.NE'!$C$6:$C$166,'IND. AMM.NE'!$L$6:$L$166))","v":0},0,0,0,0,0,0,0,0,0,0,0,null,0,null,null,"",{"$f":"IF(C42=\"\",\"\",IF(ISNA(LOOKUP(BB42,RIFERIMENTI!$P$56:$P$70,RIFERIMENTI!$S$56:$S$70)),\"DIF\",LOOKUP(BB42,RIFERIMENTI!$P$56:$P$70,RIFERIMENTI!$S$56:$S$70)))","v":""},{"$f":"IF(BB42=\"\",\"\",IF(BC42=\"DIF\",0,VLOOKUP(E42,RIFERIMENTI!$H$2:$N$17,7,FALSE)))","v":""},null,{"$f":"IF(ISNA(VLOOKUP(BC42,'IND. AMM.NE'!$U$4:$V$26,2,FALSE)),\"DIFESA\",VLOOKUP(BC42,'IND. AMM.NE'!$U$4:$V$26,2,FALSE))","v":"DIFESA"},null,0]
[null,null,{"$f":"IF(RIFERIMENTI!$Q$31>0,\"\",RIFERIMENTI!AJ29)","v":""},{"$f":"IF(RIFERIMENTI!$Q$31>0,\"\",RIFERIMENTI!AK29)","v":""},{"$f":"IF(C43=\"\",\"\",IF(RIFERIMENTI!$Q$31=1,\"\",LOOKUP(C43,RIFERIMENTI!$V$49:$V$55,RIFERIMENTI!$W$49:$W$55)))","v":""},{"$f":"IF(C43=\"\",0,(LOOKUP(CONCATENATE(E43,\" \",C43),STIPENDIO!$B$5:$B$391,STIPENDIO!$H$5:$H$391))+(LOOKUP(CONCATENATE(E43,\" \",C43),'IND. INT. SPEC.'!$B$6:$B$39,'IND. INT. SPEC.'!$H$6:$H$39)))","v":0},{"$f":"IF(C43=\"\",0,IF(BC43=\"DIF\",LOOKUP(CONCATENATE(E43,\" \",C43),'IND. AMM.NE'!$C$6:$C$166,'IND. AMM.NE'!$L$6:$L$166),VLOOKUP(CONCATENATE(BC43,\" \",BB43),'IND. AMM.NE'!$A$171:$X$253,BD43,TRUE)))","v":0},{"$f":"IF(C43=\"\",0,LOOKUP(CONCATENATE(E43,\" \",C43),'CCNL 2019-2021'!$C$99:$C$130,'CCNL 2019-2021'!$J$99:$J$130))","v":0},{"$f":"IF(C43=\"\",0,LOOKUP(CONCATENATE(E43,\" \",C43),'VACANZA CONTR.LE'!$B$5:$B$300,'VACANZA CONTR.LE'!$J$5:$J$300))","v":0},0,0,0,0,null,0,null,"",null,null,null,null,null,null,null,null,null,null,null,null,null,null,null,null,"","","",0,{"$f":"IF(C43=\"\",0,LOOKUP(CONCATENATE(E43,\" \",C43),'IND. AMM.NE'!$C$6:$C$166,'IND. AMM.NE'!$L$6:$L$166))","v":0},0,0,0,0,0,0,0,0,0,0,0,null,0,null,null,"",{"$f":"IF(C43=\"\",\"\",IF(ISNA(LOOKUP(BB43,RIFERIMENTI!$P$56:$P$70,RIFERIMENTI!$S$56:$S$70)),\"DIF\",LOOKUP(BB43,RIFERIMENTI!$P$56:$P$70,RIFERIMENTI!$S$56:$S$70)))","v":""},{"$f":"IF(BB43=\"\",\"\",IF(BC43=\"DIF\",0,VLOOKUP(E43,RIFERIMENTI!$H$2:$N$17,7,FALSE)))","v":""},null,{"$f":"IF(ISNA(VLOOKUP(BC43,'IND. AMM.NE'!$U$4:$V$26,2,FALSE)),\"DIFESA\",VLOOKUP(BC43,'IND. AMM.NE'!$U$4:$V$26,2,FALSE))","v":"DIFESA"},null,0]
[null,null,{"$f":"IF(RIFERIMENTI!$Q$31>0,\"\",RIFERIMENTI!AJ30)","v":""},{"$f":"IF(RIFERIMENTI!$Q$31>0,\"\",RIFERIMENTI!AK30)","v":""},{"$f":"IF(C44=\"\",\"\",IF(RIFERIMENTI!$Q$31=1,\"\",LOOKUP(C44,RIFERIMENTI!$V$49:$V$55,RIFERIMENTI!$W$49:$W$55)))","v":""},{"$f":"IF(C44=\"\",0,(LOOKUP(CONCATENATE(E44,\" \",C44),STIPENDIO!$B$5:$B$391,STIPENDIO!$H$5:$H$391))+(LOOKUP(CONCATENATE(E44,\" \",C44),'IND. INT. SPEC.'!$B$6:$B$39,'IND. INT. SPEC.'!$H$6:$H$39)))","v":0},{"$f":"IF(C44=\"\",0,IF(BC44=\"DIF\",LOOKUP(CONCATENATE(E44,\" \",C44),'IND. AMM.NE'!$C$6:$C$166,'IND. AMM.NE'!$L$6:$L$166),VLOOKUP(CONCATENATE(BC44,\" \",BB44),'IND. AMM.NE'!$A$171:$X$253,BD44,TRUE)))","v":0},{"$f":"IF(C44=\"\",0,LOOKUP(CONCATENATE(E44,\" \",C44),'CCNL 2019-2021'!$C$99:$C$130,'CCNL 2019-2021'!$J$99:$J$130))","v":0},{"$f":"IF(C44=\"\",0,LOOKUP(CONCATENATE(E44,\" \",C44),'VACANZA CONTR.LE'!$B$5:$B$300,'VACANZA CONTR.LE'!$J$5:$J$300))","v":0},0,0,0,0,null,0,null,"",null,null,null,null,null,null,null,null,null,null,null,null,null,null,null,null,"","","",0,{"$f":"IF(C44=\"\",0,LOOKUP(CONCATENATE(E44,\" \",C44),'IND. AMM.NE'!$C$6:$C$166,'IND. AMM.NE'!$L$6:$L$166))","v":0},0,0,0,0,0,0,0,0,0,0,0,null,0,null,null,"",{"$f":"IF(C44=\"\",\"\",IF(ISNA(LOOKUP(BB44,RIFERIMENTI!$P$56:$P$70,RIFERIMENTI!$S$56:$S$70)),\"DIF\",LOOKUP(BB44,RIFERIMENTI!$P$56:$P$70,RIFERIMENTI!$S$56:$S$70)))","v":""},{"$f":"IF(BB44=\"\",\"\",IF(BC44=\"DIF\",0,VLOOKUP(E44,RIFERIMENTI!$H$2:$N$17,7,FALSE)))","v":""},null,{"$f":"IF(ISNA(VLOOKUP(BC44,'IND. AMM.NE'!$U$4:$V$26,2,FALSE)),\"DIFESA\",VLOOKUP(BC44,'IND. AMM.NE'!$U$4:$V$26,2,FALSE))","v":"DIFESA"},null,0]
[null,null,{"$f":"IF(RIFERIMENTI!$Q$31>0,\"\",RIFERIMENTI!AJ31)","v":""},{"$f":"IF(RIFERIMENTI!$Q$31>0,\"\",RIFERIMENTI!AK31)","v":""},{"$f":"IF(C45=\"\",\"\",IF(RIFERIMENTI!$Q$31=1,\"\",LOOKUP(C45,RIFERIMENTI!$V$49:$V$55,RIFERIMENTI!$W$49:$W$55)))","v":""},{"$f":"IF(C45=\"\",0,(LOOKUP(CONCATENATE(E45,\" \",C45),STIPENDIO!$B$5:$B$391,STIPENDIO!$H$5:$H$391))+(LOOKUP(CONCATENATE(E45,\" \",C45),'IND. INT. SPEC.'!$B$6:$B$39,'IND. INT. SPEC.'!$H$6:$H$39)))","v":0},{"$f":"IF(C45=\"\",0,IF(BC45=\"DIF\",LOOKUP(CONCATENATE(E45,\" \",C45),'IND. AMM.NE'!$C$6:$C$166,'IND. AMM.NE'!$L$6:$L$166),VLOOKUP(CONCATENATE(BC45,\" \",BB45),'IND. AMM.NE'!$A$171:$X$253,BD45,TRUE)))","v":0},{"$f":"IF(C45=\"\",0,LOOKUP(CONCATENATE(E45,\" \",C45),'CCNL 2019-2021'!$C$99:$C$130,'CCNL 2019-2021'!$J$99:$J$130))","v":0},{"$f":"IF(C45=\"\",0,LOOKUP(CONCATENATE(E45,\" \",C45),'VACANZA CONTR.LE'!$B$5:$B$300,'VACANZA CONTR.LE'!$J$5:$J$300))","v":0},0,0,0,0,null,0,null,"",null,null,null,null,null,null,null,null,null,null,null,null,null,null,null,null,"","","",0,{"$f":"IF(C45=\"\",0,LOOKUP(CONCATENATE(E45,\" \",C45),'IND. AMM.NE'!$C$6:$C$166,'IND. AMM.NE'!$L$6:$L$166))","v":0},0,0,0,0,0,0,0,0,0,0,0,null,0,null,null,"",{"$f":"IF(C45=\"\",\"\",IF(ISNA(LOOKUP(BB45,RIFERIMENTI!$P$56:$P$70,RIFERIMENTI!$S$56:$S$70)),\"DIF\",LOOKUP(BB45,RIFERIMENTI!$P$56:$P$70,RIFERIMENTI!$S$56:$S$70)))","v":""},{"$f":"IF(BB45=\"\",\"\",IF(BC45=\"DIF\",0,VLOOKUP(E45,RIFERIMENTI!$H$2:$N$17,7,FALSE)))","v":""},null,{"$f":"IF(ISNA(VLOOKUP(BC45,'IND. AMM.NE'!$U$4:$V$26,2,FALSE)),\"DIFESA\",VLOOKUP(BC45,'IND. AMM.NE'!$U$4:$V$26,2,FALSE))","v":"DIFESA"},null,0]
[null,null,{"$f":"IF(RIFERIMENTI!$Q$31>0,\"\",RIFERIMENTI!AJ32)","v":""},{"$f":"IF(RIFERIMENTI!$Q$31>0,\"\",RIFERIMENTI!AK32)","v":""},{"$f":"IF(C46=\"\",\"\",IF(RIFERIMENTI!$Q$31=1,\"\",LOOKUP(C46,RIFERIMENTI!$V$49:$V$55,RIFERIMENTI!$W$49:$W$55)))","v":""},{"$f":"IF(C46=\"\",0,(LOOKUP(CONCATENATE(E46,\" \",C46),STIPENDIO!$B$5:$B$391,STIPENDIO!$H$5:$H$391))+(LOOKUP(CONCATENATE(E46,\" \",C46),'IND. INT. SPEC.'!$B$6:$B$39,'IND. INT. SPEC.'!$H$6:$H$39)))","v":0},{"$f":"IF(C46=\"\",0,IF(BC46=\"DIF\",LOOKUP(CONCATENATE(E46,\" \",C46),'IND. AMM.NE'!$C$6:$C$166,'IND. AMM.NE'!$L$6:$L$166),VLOOKUP(CONCATENATE(BC46,\" \",BB46),'IND. AMM.NE'!$A$171:$X$253,BD46,TRUE)))","v":0},{"$f":"IF(C46=\"\",0,LOOKUP(CONCATENATE(E46,\" \",C46),'CCNL 2019-2021'!$C$99:$C$130,'CCNL 2019-2021'!$J$99:$J$130))","v":0},{"$f":"IF(C46=\"\",0,LOOKUP(CONCATENATE(E46,\" \",C46),'VACANZA CONTR.LE'!$B$5:$B$300,'VACANZA CONTR.LE'!$J$5:$J$300))","v":0},0,0,0,0,null,0,null,"",null,null,null,null,null,null,null,null,null,null,null,null,null,null,null,null,"","","",0,{"$f":"IF(C46=\"\",0,LOOKUP(CONCATENATE(E46,\" \",C46),'IND. AMM.NE'!$C$6:$C$166,'IND. AMM.NE'!$L$6:$L$166))","v":0},0,0,0,0,0,0,0,0,0,0,0,null,0,null,null,"",{"$f":"IF(C46=\"\",\"\",IF(ISNA(LOOKUP(BB46,RIFERIMENTI!$P$56:$P$70,RIFERIMENTI!$S$56:$S$70)),\"DIF\",LOOKUP(BB46,RIFERIMENTI!$P$56:$P$70,RIFERIMENTI!$S$56:$S$70)))","v":""},{"$f":"IF(BB46=\"\",\"\",IF(BC46=\"DIF\",0,VLOOKUP(E46,RIFERIMENTI!$H$2:$N$17,7,FALSE)))","v":""},null,{"$f":"IF(ISNA(VLOOKUP(BC46,'IND. AMM.NE'!$U$4:$V$26,2,FALSE)),\"DIFESA\",VLOOKUP(BC46,'IND. AMM.NE'!$U$4:$V$26,2,FALSE))","v":"DIFESA"},null,0]
[null,null,{"$f":"IF(RIFERIMENTI!$Q$31>0,\"\",RIFERIMENTI!AJ33)","v":""},{"$f":"IF(RIFERIMENTI!$Q$31>0,\"\",RIFERIMENTI!AK33)","v":""},{"$f":"IF(C47=\"\",\"\",IF(RIFERIMENTI!$Q$31=1,\"\",LOOKUP(C47,RIFERIMENTI!$V$49:$V$55,RIFERIMENTI!$W$49:$W$55)))","v":""},{"$f":"IF(C47=\"\",0,(LOOKUP(CONCATENATE(E47,\" \",C47),STIPENDIO!$B$5:$B$391,STIPENDIO!$H$5:$H$391))+(LOOKUP(CONCATENATE(E47,\" \",C47),'IND. INT. SPEC.'!$B$6:$B$39,'IND. INT. SPEC.'!$H$6:$H$39)))","v":0},{"$f":"IF(C47=\"\",0,IF(BC47=\"DIF\",LOOKUP(CONCATENATE(E47,\" \",C47),'IND. AMM.NE'!$C$6:$C$166,'IND. AMM.NE'!$L$6:$L$166),VLOOKUP(CONCATENATE(BC47,\" \",BB47),'IND. AMM.NE'!$A$171:$X$253,BD47,TRUE)))","v":0},{"$f":"IF(C47=\"\",0,LOOKUP(CONCATENATE(E47,\" \",C47),'CCNL 2019-2021'!$C$99:$C$130,'CCNL 2019-2021'!$J$99:$J$130))","v":0},{"$f":"IF(C47=\"\",0,LOOKUP(CONCATENATE(E47,\" \",C47),'VACANZA CONTR.LE'!$B$5:$B$300,'VACANZA CONTR.LE'!$J$5:$J$300))","v":0},0,0,0,0,null,0,null,"",null,null,null,null,null,null,null,null,null,null,null,null,null,null,null,null,"","","",0,{"$f":"IF(C47=\"\",0,LOOKUP(CONCATENATE(E47,\" \",C47),'IND. AMM.NE'!$C$6:$C$166,'IND. AMM.NE'!$L$6:$L$166))","v":0},0,0,0,0,0,0,0,0,0,0,0,null,0,null,null,"",{"$f":"IF(C47=\"\",\"\",IF(ISNA(LOOKUP(BB47,RIFERIMENTI!$P$56:$P$70,RIFERIMENTI!$S$56:$S$70)),\"DIF\",LOOKUP(BB47,RIFERIMENTI!$P$56:$P$70,RIFERIMENTI!$S$56:$S$70)))","v":""},{"$f":"IF(BB47=\"\",\"\",IF(BC47=\"DIF\",0,VLOOKUP(E47,RIFERIMENTI!$H$2:$N$17,7,FALSE)))","v":""},null,{"$f":"IF(ISNA(VLOOKUP(BC47,'IND. AMM.NE'!$U$4:$V$26,2,FALSE)),\"DIFESA\",VLOOKUP(BC47,'IND. AMM.NE'!$U$4:$V$26,2,FALSE))","v":"DIFESA"},null,0]
[null,null,{"$f":"IF(RIFERIMENTI!$Q$31>0,\"\",RIFERIMENTI!AJ34)","v":""},{"$f":"IF(RIFERIMENTI!$Q$31>0,\"\",RIFERIMENTI!AK34)","v":""},{"$f":"IF(C48=\"\",\"\",IF(RIFERIMENTI!$Q$31=1,\"\",LOOKUP(C48,RIFERIMENTI!$V$49:$V$55,RIFERIMENTI!$W$49:$W$55)))","v":""},{"$f":"IF(C48=\"\",0,(LOOKUP(CONCATENATE(E48,\" \",C48),STIPENDIO!$B$5:$B$391,STIPENDIO!$H$5:$H$391))+(LOOKUP(CONCATENATE(E48,\" \",C48),'IND. INT. SPEC.'!$B$6:$B$39,'IND. INT. SPEC.'!$H$6:$H$39)))","v":0},{"$f":"IF(C48=\"\",0,IF(BC48=\"DIF\",LOOKUP(CONCATENATE(E48,\" \",C48),'IND. AMM.NE'!$C$6:$C$166,'IND. AMM.NE'!$L$6:$L$166),VLOOKUP(CONCATENATE(BC48,\" \",BB48),'IND. AMM.NE'!$A$171:$X$253,BD48,TRUE)))","v":0},{"$f":"IF(C48=\"\",0,LOOKUP(CONCATENATE(E48,\" \",C48),'CCNL 2019-2021'!$C$99:$C$130,'CCNL 2019-2021'!$J$99:$J$130))","v":0},{"$f":"IF(C48=\"\",0,LOOKUP(CONCATENATE(E48,\" \",C48),'VACANZA CONTR.LE'!$B$5:$B$300,'VACANZA CONTR.LE'!$J$5:$J$300))","v":0},0,0,0,0,null,0,null,"",null,null,null,null,null,null,null,null,null,null,null,null,null,null,null,null,"","","",0,{"$f":"IF(C48=\"\",0,LOOKUP(CONCATENATE(E48,\" \",C48),'IND. AMM.NE'!$C$6:$C$166,'IND. AMM.NE'!$L$6:$L$166))","v":0},0,0,0,0,0,0,0,0,0,0,0,null,0,null,null,"",{"$f":"IF(C48=\"\",\"\",IF(ISNA(LOOKUP(BB48,RIFERIMENTI!$P$56:$P$70,RIFERIMENTI!$S$56:$S$70)),\"DIF\",LOOKUP(BB48,RIFERIMENTI!$P$56:$P$70,RIFERIMENTI!$S$56:$S$70)))","v":""},{"$f":"IF(BB48=\"\",\"\",IF(BC48=\"DIF\",0,VLOOKUP(E48,RIFERIMENTI!$H$2:$N$17,7,FALSE)))","v":""},null,{"$f":"IF(ISNA(VLOOKUP(BC48,'IND. AMM.NE'!$U$4:$V$26,2,FALSE)),\"DIFESA\",VLOOKUP(BC48,'IND. AMM.NE'!$U$4:$V$26,2,FALSE))","v":"DIFESA"},null,0]
[null,null,{"$f":"IF(RIFERIMENTI!$Q$31>0,\"\",RIFERIMENTI!AJ35)","v":""},{"$f":"IF(RIFERIMENTI!$Q$31>0,\"\",RIFERIMENTI!AK35)","v":""},{"$f":"IF(C49=\"\",\"\",IF(RIFERIMENTI!$Q$31=1,\"\",LOOKUP(C49,RIFERIMENTI!$V$49:$V$55,RIFERIMENTI!$W$49:$W$55)))","v":""},{"$f":"IF(C49=\"\",0,(LOOKUP(CONCATENATE(E49,\" \",C49),STIPENDIO!$B$5:$B$391,STIPENDIO!$H$5:$H$391))+(LOOKUP(CONCATENATE(E49,\" \",C49),'IND. INT. SPEC.'!$B$6:$B$39,'IND. INT. SPEC.'!$H$6:$H$39)))","v":0},{"$f":"IF(C49=\"\",0,IF(BC49=\"DIF\",LOOKUP(CONCATENATE(E49,\" \",C49),'IND. AMM.NE'!$C$6:$C$166,'IND. AMM.NE'!$L$6:$L$166),VLOOKUP(CONCATENATE(BC49,\" \",BB49),'IND. AMM.NE'!$A$171:$X$253,BD49,TRUE)))","v":0},{"$f":"IF(C49=\"\",0,LOOKUP(CONCATENATE(E49,\" \",C49),'CCNL 2019-2021'!$C$99:$C$130,'CCNL 2019-2021'!$J$99:$J$130))","v":0},{"$f":"IF(C49=\"\",0,LOOKUP(CONCATENATE(E49,\" \",C49),'VACANZA CONTR.LE'!$B$5:$B$300,'VACANZA CONTR.LE'!$J$5:$J$300))","v":0},0,0,0,0,null,0,null,"",null,null,null,null,null,null,null,null,null,null,null,null,null,null,null,null,"","","",0,{"$f":"IF(C49=\"\",0,LOOKUP(CONCATENATE(E49,\" \",C49),'IND. AMM.NE'!$C$6:$C$166,'IND. AMM.NE'!$L$6:$L$166))","v":0},0,0,0,0,0,0,0,0,0,0,0,null,0,null,null,"",{"$f":"IF(C49=\"\",\"\",IF(ISNA(LOOKUP(BB49,RIFERIMENTI!$P$56:$P$70,RIFERIMENTI!$S$56:$S$70)),\"DIF\",LOOKUP(BB49,RIFERIMENTI!$P$56:$P$70,RIFERIMENTI!$S$56:$S$70)))","v":""},{"$f":"IF(BB49=\"\",\"\",IF(BC49=\"DIF\",0,VLOOKUP(E49,RIFERIMENTI!$H$2:$N$17,7,FALSE)))","v":""},null,{"$f":"IF(ISNA(VLOOKUP(BC49,'IND. AMM.NE'!$U$4:$V$26,2,FALSE)),\"DIFESA\",VLOOKUP(BC49,'IND. AMM.NE'!$U$4:$V$26,2,FALSE))","v":"DIFESA"},null,0]
[null,null,{"$f":"IF(RIFERIMENTI!$Q$31>0,\"\",RIFERIMENTI!AJ36)","v":""},{"$f":"IF(RIFERIMENTI!$Q$31>0,\"\",RIFERIMENTI!AK36)","v":""},{"$f":"IF(C50=\"\",\"\",IF(RIFERIMENTI!$Q$31=1,\"\",LOOKUP(C50,RIFERIMENTI!$V$49:$V$55,RIFERIMENTI!$W$49:$W$55)))","v":""},{"$f":"IF(C50=\"\",0,(LOOKUP(CONCATENATE(E50,\" \",C50),STIPENDIO!$B$5:$B$391,STIPENDIO!$H$5:$H$391))+(LOOKUP(CONCATENATE(E50,\" \",C50),'IND. INT. SPEC.'!$B$6:$B$39,'IND. INT. SPEC.'!$H$6:$H$39)))","v":0},{"$f":"IF(C50=\"\",0,IF(BC50=\"DIF\",LOOKUP(CONCATENATE(E50,\" \",C50),'IND. AMM.NE'!$C$6:$C$166,'IND. AMM.NE'!$L$6:$L$166),VLOOKUP(CONCATENATE(BC50,\" \",BB50),'IND. AMM.NE'!$A$171:$X$253,BD50,TRUE)))","v":0},{"$f":"IF(C50=\"\",0,LOOKUP(CONCATENATE(E50,\" \",C50),'CCNL 2019-2021'!$C$99:$C$130,'CCNL 2019-2021'!$J$99:$J$130))","v":0},{"$f":"IF(C50=\"\",0,LOOKUP(CONCATENATE(E50,\" \",C50),'VACANZA CONTR.LE'!$B$5:$B$300,'VACANZA CONTR.LE'!$J$5:$J$300))","v":0},0,0,0,0,null,0,null,"",null,null,null,null,null,null,null,null,null,null,null,null,null,null,null,null,"","","",0,{"$f":"IF(C50=\"\",0,LOOKUP(CONCATENATE(E50,\" \",C50),'IND. AMM.NE'!$C$6:$C$166,'IND. AMM.NE'!$L$6:$L$166))","v":0},0,0,0,0,0,0,0,0,0,0,0,null,0,null,null,"",{"$f":"IF(C50=\"\",\"\",IF(ISNA(LOOKUP(BB50,RIFERIMENTI!$P$56:$P$70,RIFERIMENTI!$S$56:$S$70)),\"DIF\",LOOKUP(BB50,RIFERIMENTI!$P$56:$P$70,RIFERIMENTI!$S$56:$S$70)))","v":""},{"$f":"IF(BB50=\"\",\"\",IF(BC50=\"DIF\",0,VLOOKUP(E50,RIFERIMENTI!$H$2:$N$17,7,FALSE)))","v":""},null,{"$f":"IF(ISNA(VLOOKUP(BC50,'IND. AMM.NE'!$U$4:$V$26,2,FALSE)),\"DIFESA\",VLOOKUP(BC50,'IND. AMM.NE'!$U$4:$V$26,2,FALSE))","v":"DIFESA"},null,0]
[null,null,{"$f":"IF(RIFERIMENTI!$Q$31>0,\"\",RIFERIMENTI!AJ38)","v":""},{"$f":"IF(RIFERIMENTI!$Q$31>0,\"\",RIFERIMENTI!AK38)","v":""},{"$f":"IF(C51=\"\",\"\",IF(RIFERIMENTI!$Q$31=1,\"\",LOOKUP(C51,RIFERIMENTI!$V$49:$V$55,RIFERIMENTI!$W$49:$W$55)))","v":""},{"$f":"IF(C51=\"\",0,(LOOKUP(CONCATENATE(E51,\" \",C51),STIPENDIO!$B$5:$B$391,STIPENDIO!$H$5:$H$391))+(LOOKUP(CONCATENATE(E51,\" \",C51),'IND. INT. SPEC.'!$B$6:$B$39,'IND. INT. SPEC.'!$H$6:$H$39)))","v":0},{"$f":"IF(C51=\"\",0,IF(BC51=\"DIF\",LOOKUP(CONCATENATE(E51,\" \",C51),'IND. AMM.NE'!$C$6:$C$166,'IND. AMM.NE'!$L$6:$L$166),VLOOKUP(CONCATENATE(BC51,\" \",BB51),'IND. AMM.NE'!$A$171:$X$253,BD51,TRUE)))","v":0},{"$f":"IF(C51=\"\",0,LOOKUP(CONCATENATE(E51,\" \",C51),'CCNL 2019-2021'!$C$99:$C$130,'CCNL 2019-2021'!$J$99:$J$130))","v":0},{"$f":"IF(C51=\"\",0,LOOKUP(CONCATENATE(E51,\" \",C51),'VACANZA CONTR.LE'!$B$5:$B$300,'VACANZA CONTR.LE'!$J$5:$J$300))","v":0},0,0,0,0,null,0,null,"",null,null,null,null,null,null,null,null,null,null,null,null,null,null,null,null,"","","",0,{"$f":"IF(C51=\"\",0,LOOKUP(CONCATENATE(E51,\" \",C51),'IND. AMM.NE'!$C$6:$C$166,'IND. AMM.NE'!$L$6:$L$166))","v":0},0,0,0,0,0,0,0,{"$f":"IF(AH51=\"\",0,IF(AND(Q50=\"DIF\",AH51=DATE(2022,11,1),((AK51+AM51+AO51+AP51+AQ51)+(AT50-AR51))>$AV$16,($AV$16-(AK51+AM51+AO51+AP51+AQ51))<0),0,IF(AND(Q50=\"DIF\",AH51=DATE(2022,11,1),((AK51+AM51+AO51+AP51+AQ51)+(AT50-AR51))>$AV$16),$AV$16-(AK51+AM51+AO51+AP51+AQ51),IF(AND(Q50=\"DIF\",AH51=DATE(2022,11,1)),AT50-AR51,IF(AT50=0,0,IF((AT50-AR51)>0,AT50-AR51,0))))))","v":0},{"$f":"IF(AH51=\"\",0,IF(AND(Q50=\"DIF\",AH51=DATE(2022,11,1),((AK51+AM51+AO51+AP51+AQ51)+(AT50-AS51))>$AV$16,($AV$16-(AK51+AM51+AO51+AP51+AQ51))<0),0,IF(AND(Q50=\"DIF\",AH51=DATE(2022,11,1),((AK51+AM51+AO51+AP51+AQ51)+(AT50-AS51))>$AV$16),$AV$16-(AK51+AM51+AO51+AP51+AQ51),IF(AND(Q50=\"DIF\",AH51=DATE(2022,11,1)),AT50-AS51,IF(AT50=0,0,IF((AT50-AS51)>0,AT50-AS51,0))))))","v":0},0,0,null,0,null,null,"",{"$f":"IF(C51=\"\",\"\",IF(ISNA(LOOKUP(BB51,RIFERIMENTI!$P$56:$P$70,RIFERIMENTI!$S$56:$S$70)),\"DIF\",LOOKUP(BB51,RIFERIMENTI!$P$56:$P$70,RIFERIMENTI!$S$56:$S$70)))","v":""},{"$f":"IF(BB51=\"\",\"\",IF(BC51=\"DIF\",0,VLOOKUP(E51,RIFERIMENTI!$H$2:$N$17,7,FALSE)))","v":""},null,{"$f":"IF(ISNA(VLOOKUP(BC51,'IND. AMM.NE'!$U$4:$V$26,2,FALSE)),\"DIFESA\",VLOOKUP(BC51,'IND. AMM.NE'!$U$4:$V$26,2,FALSE))","v":"DIFESA"},null,0,null,null,null,null,null,null,null,null,null,null,null,null,null,null,null," "]
[null,null,{"$f":"IF(RIFERIMENTI!$Q$31>0,\"\",RIFERIMENTI!AJ39)","v":""},{"$f":"IF(RIFERIMENTI!$Q$31>0,\"\",RIFERIMENTI!AK39)","v":""},{"$f":"IF(C52=\"\",\"\",IF(RIFERIMENTI!$Q$31=1,\"\",LOOKUP(C52,RIFERIMENTI!$V$49:$V$55,RIFERIMENTI!$W$49:$W$55)))","v":""},{"$f":"IF(C52=\"\",0,(LOOKUP(CONCATENATE(E52,\" \",C52),STIPENDIO!$B$5:$B$391,STIPENDIO!$H$5:$H$391))+(LOOKUP(CONCATENATE(E52,\" \",C52),'IND. INT. SPEC.'!$B$6:$B$39,'IND. INT. SPEC.'!$H$6:$H$39)))","v":0},{"$f":"IF(C52=\"\",0,IF(BC52=\"DIF\",LOOKUP(CONCATENATE(E52,\" \",C52),'IND. AMM.NE'!$C$6:$C$166,'IND. AMM.NE'!$L$6:$L$166),VLOOKUP(CONCATENATE(BC52,\" \",BB52),'IND. AMM.NE'!$A$171:$X$253,BD52,TRUE)))","v":0},{"$f":"IF(C52=\"\",0,LOOKUP(CONCATENATE(E52,\" \",C52),'CCNL 2019-2021'!$C$99:$C$130,'CCNL 2019-2021'!$J$99:$J$130))","v":0},{"$f":"IF(C52=\"\",0,LOOKUP(CONCATENATE(E52,\" \",C52),'VACANZA CONTR.LE'!$B$5:$B$300,'VACANZA CONTR.LE'!$J$5:$J$300))","v":0},0,0,0,0,null,0,null,"",null,null,null,null,null,null,null,null,null,null,null,null,null,null,null,null,"","","",0,{"$f":"IF(C52=\"\",0,LOOKUP(CONCATENATE(E52,\" \",C52),'IND. AMM.NE'!$C$6:$C$166,'IND. AMM.NE'!$L$6:$L$166))","v":0},0,0,0,0,0,0,0,0,0,0,0,null,0,null,null,"",{"$f":"IF(C52=\"\",\"\",IF(ISNA(LOOKUP(BB52,RIFERIMENTI!$P$56:$P$70,RIFERIMENTI!$S$56:$S$70)),\"DIF\",LOOKUP(BB52,RIFERIMENTI!$P$56:$P$70,RIFERIMENTI!$S$56:$S$70)))","v":""},{"$f":"IF(BB52=\"\",\"\",IF(BC52=\"DIF\",0,VLOOKUP(E52,RIFERIMENTI!$H$2:$N$17,7,FALSE)))","v":""},null,{"$f":"IF(ISNA(VLOOKUP(BC52,'IND. AMM.NE'!$U$4:$V$26,2,FALSE)),\"DIFESA\",VLOOKUP(BC52,'IND. AMM.NE'!$U$4:$V$26,2,FALSE))","v":"DIFESA"},null,0]
[null,null,{"$f":"IF(RIFERIMENTI!$Q$31>0,\"\",RIFERIMENTI!AJ40)","v":""},{"$f":"IF(RIFERIMENTI!$Q$31>0,\"\",RIFERIMENTI!AK40)","v":""},{"$f":"IF(C53=\"\",\"\",IF(RIFERIMENTI!$Q$31=1,\"\",LOOKUP(C53,RIFERIMENTI!$V$49:$V$55,RIFERIMENTI!$W$49:$W$55)))","v":""},{"$f":"IF(C53=\"\",0,(LOOKUP(CONCATENATE(E53,\" \",C53),STIPENDIO!$B$5:$B$391,STIPENDIO!$H$5:$H$391))+(LOOKUP(CONCATENATE(E53,\" \",C53),'IND. INT. SPEC.'!$B$6:$B$39,'IND. INT. SPEC.'!$H$6:$H$39)))","v":0},{"$f":"IF(C53=\"\",0,IF(BC53=\"DIF\",LOOKUP(CONCATENATE(E53,\" \",C53),'IND. AMM.NE'!$C$6:$C$166,'IND. AMM.NE'!$L$6:$L$166),VLOOKUP(CONCATENATE(BC53,\" \",BB53),'IND. AMM.NE'!$A$171:$X$253,BD53,TRUE)))","v":0},{"$f":"IF(C53=\"\",0,LOOKUP(CONCATENATE(E53,\" \",C53),'CCNL 2019-2021'!$C$99:$C$130,'CCNL 2019-2021'!$J$99:$J$130))","v":0},{"$f":"IF(C53=\"\",0,LOOKUP(CONCATENATE(E53,\" \",C53),'VACANZA CONTR.LE'!$B$5:$B$300,'VACANZA CONTR.LE'!$J$5:$J$300))","v":0},0,0,0,0,null,0,null,"",null,null,null,null,null,null,null,null,null,null,null,null,null,null,null,null,"","","",0,{"$f":"IF(C53=\"\",0,LOOKUP(CONCATENATE(E53,\" \",C53),'IND. AMM.NE'!$C$6:$C$166,'IND. AMM.NE'!$L$6:$L$166))","v":0},0,0,0,0,0,0,0,0,0,0,0,null,0,null,null,"",{"$f":"IF(C53=\"\",\"\",IF(ISNA(LOOKUP(BB53,RIFERIMENTI!$P$56:$P$70,RIFERIMENTI!$S$56:$S$70)),\"DIF\",LOOKUP(BB53,RIFERIMENTI!$P$56:$P$70,RIFERIMENTI!$S$56:$S$70)))","v":""},{"$f":"IF(BB53=\"\",\"\",IF(BC53=\"DIF\",0,VLOOKUP(E53,RIFERIMENTI!$H$2:$N$17,7,FALSE)))","v":""},null,{"$f":"IF(ISNA(VLOOKUP(BC53,'IND. AMM.NE'!$U$4:$V$26,2,FALSE)),\"DIFESA\",VLOOKUP(BC53,'IND. AMM.NE'!$U$4:$V$26,2,FALSE))","v":"DIFESA"},null,0]
[null,null,{"$f":"IF(RIFERIMENTI!$Q$31>0,\"\",RIFERIMENTI!AJ41)","v":""},{"$f":"IF(RIFERIMENTI!$Q$31>0,\"\",RIFERIMENTI!AK41)","v":""},{"$f":"IF(C54=\"\",\"\",IF(RIFERIMENTI!$Q$31=1,\"\",LOOKUP(C54,RIFERIMENTI!$V$49:$V$55,RIFERIMENTI!$W$49:$W$55)))","v":""},{"$f":"IF(C54=\"\",0,(LOOKUP(CONCATENATE(E54,\" \",C54),STIPENDIO!$B$5:$B$391,STIPENDIO!$H$5:$H$391))+(LOOKUP(CONCATENATE(E54,\" \",C54),'IND. INT. SPEC.'!$B$6:$B$39,'IND. INT. SPEC.'!$H$6:$H$39)))","v":0},{"$f":"IF(C54=\"\",0,IF(BC54=\"DIF\",LOOKUP(CONCATENATE(E54,\" \",C54),'IND. AMM.NE'!$C$6:$C$166,'IND. AMM.NE'!$L$6:$L$166),VLOOKUP(CONCATENATE(BC54,\" \",BB54),'IND. AMM.NE'!$A$171:$X$253,BD54,TRUE)))","v":0},{"$f":"IF(C54=\"\",0,LOOKUP(CONCATENATE(E54,\" \",C54),'CCNL 2019-2021'!$C$99:$C$130,'CCNL 2019-2021'!$J$99:$J$130))","v":0},{"$f":"IF(C54=\"\",0,LOOKUP(CONCATENATE(E54,\" \",C54),'VACANZA CONTR.LE'!$B$5:$B$300,'VACANZA CONTR.LE'!$J$5:$J$300))","v":0},0,0,0,0,null,0,null,"",null,null,null,null,null,null,null,null,null,null,null,null,null,null,null,null,"","","",0,{"$f":"IF(C54=\"\",0,LOOKUP(CONCATENATE(E54,\" \",C54),'IND. AMM.NE'!$C$6:$C$166,'IND. AMM.NE'!$L$6:$L$166))","v":0},0,0,0,0,0,0,0,0,0,0,0,null,0,null,null,"",{"$f":"IF(C54=\"\",\"\",IF(ISNA(LOOKUP(BB54,RIFERIMENTI!$P$56:$P$70,RIFERIMENTI!$S$56:$S$70)),\"DIF\",LOOKUP(BB54,RIFERIMENTI!$P$56:$P$70,RIFERIMENTI!$S$56:$S$70)))","v":""},{"$f":"IF(BB54=\"\",\"\",IF(BC54=\"DIF\",0,VLOOKUP(E54,RIFERIMENTI!$H$2:$N$17,7,FALSE)))","v":""},null,{"$f":"IF(ISNA(VLOOKUP(BC54,'IND. AMM.NE'!$U$4:$V$26,2,FALSE)),\"DIFESA\",VLOOKUP(BC54,'IND. AMM.NE'!$U$4:$V$26,2,FALSE))","v":"DIFESA"},null,0]
[null,null,{"$f":"IF(RIFERIMENTI!$Q$31>0,\"\",RIFERIMENTI!AJ42)","v":""},{"$f":"IF(RIFERIMENTI!$Q$31>0,\"\",RIFERIMENTI!AK42)","v":""},{"$f":"IF(C55=\"\",\"\",IF(RIFERIMENTI!$Q$31=1,\"\",LOOKUP(C55,RIFERIMENTI!$V$49:$V$55,RIFERIMENTI!$W$49:$W$55)))","v":""},{"$f":"IF(C55=\"\",0,(LOOKUP(CONCATENATE(E55,\" \",C55),STIPENDIO!$B$5:$B$391,STIPENDIO!$H$5:$H$391))+(LOOKUP(CONCATENATE(E55,\" \",C55),'IND. INT. SPEC.'!$B$6:$B$39,'IND. INT. SPEC.'!$H$6:$H$39)))","v":0},{"$f":"IF(C55=\"\",0,IF(BC55=\"DIF\",LOOKUP(CONCATENATE(E55,\" \",C55),'IND. AMM.NE'!$C$6:$C$166,'IND. AMM.NE'!$L$6:$L$166),VLOOKUP(CONCATENATE(BC55,\" \",BB55),'IND. AMM.NE'!$A$171:$X$253,BD55,TRUE)))","v":0},{"$f":"IF(C55=\"\",0,LOOKUP(CONCATENATE(E55,\" \",C55),'CCNL 2019-2021'!$C$99:$C$130,'CCNL 2019-2021'!$J$99:$J$130))","v":0},{"$f":"IF(C55=\"\",0,LOOKUP(CONCATENATE(E55,\" \",C55),'VACANZA CONTR.LE'!$B$5:$B$300,'VACANZA CONTR.LE'!$J$5:$J$300))","v":0},0,0,0,0,null,0,null,"",null,null,null,null,null,null,null,null,null,null,null,null,null,null,null,null,"","","",0,{"$f":"IF(C55=\"\",0,LOOKUP(CONCATENATE(E55,\" \",C55),'IND. AMM.NE'!$C$6:$C$166,'IND. AMM.NE'!$L$6:$L$166))","v":0},0,0,0,0,0,0,0,0,0,0,0,null,0,null,null,"",{"$f":"IF(C55=\"\",\"\",IF(ISNA(LOOKUP(BB55,RIFERIMENTI!$P$56:$P$70,RIFERIMENTI!$S$56:$S$70)),\"DIF\",LOOKUP(BB55,RIFERIMENTI!$P$56:$P$70,RIFERIMENTI!$S$56:$S$70)))","v":""},{"$f":"IF(BB55=\"\",\"\",IF(BC55=\"DIF\",0,VLOOKUP(E55,RIFERIMENTI!$H$2:$N$17,7,FALSE)))","v":""},null,{"$f":"IF(ISNA(VLOOKUP(BC55,'IND. AMM.NE'!$U$4:$V$26,2,FALSE)),\"DIFESA\",VLOOKUP(BC55,'IND. AMM.NE'!$U$4:$V$26,2,FALSE))","v":"DIFESA"},null,0]
[null,null,{"$f":"IF(RIFERIMENTI!$Q$31>0,\"\",RIFERIMENTI!AJ43)","v":""},{"$f":"IF(RIFERIMENTI!$Q$31>0,\"\",RIFERIMENTI!AK43)","v":""},{"$f":"IF(C56=\"\",\"\",IF(RIFERIMENTI!$Q$31=1,\"\",LOOKUP(C56,RIFERIMENTI!$V$49:$V$55,RIFERIMENTI!$W$49:$W$55)))","v":""},{"$f":"IF(C56=\"\",0,(LOOKUP(CONCATENATE(E56,\" \",C56),STIPENDIO!$B$5:$B$391,STIPENDIO!$H$5:$H$391))+(LOOKUP(CONCATENATE(E56,\" \",C56),'IND. INT. SPEC.'!$B$6:$B$39,'IND. INT. SPEC.'!$H$6:$H$39)))","v":0},{"$f":"IF(C56=\"\",0,IF(BC56=\"DIF\",LOOKUP(CONCATENATE(E56,\" \",C56),'IND. AMM.NE'!$C$6:$C$166,'IND. AMM.NE'!$L$6:$L$166),VLOOKUP(CONCATENATE(BC56,\" \",BB56),'IND. AMM.NE'!$A$171:$X$253,BD56,TRUE)))","v":0},{"$f":"IF(C56=\"\",0,LOOKUP(CONCATENATE(E56,\" \",C56),'CCNL 2019-2021'!$C$99:$C$130,'CCNL 2019-2021'!$J$99:$J$130))","v":0},{"$f":"IF(C56=\"\",0,LOOKUP(CONCATENATE(E56,\" \",C56),'VACANZA CONTR.LE'!$B$5:$B$300,'VACANZA CONTR.LE'!$J$5:$J$300))","v":0},0,0,0,0,null,0,null,"",null,null,null,null,null,null,null,null,null,null,null,null,null,null,null,null,"","","",0,{"$f":"IF(C56=\"\",0,LOOKUP(CONCATENATE(E56,\" \",C56),'IND. AMM.NE'!$C$6:$C$166,'IND. AMM.NE'!$L$6:$L$166))","v":0},0,0,0,0,0,0,0,0,0,0,0,null,0,null,null,"",{"$f":"IF(C56=\"\",\"\",IF(ISNA(LOOKUP(BB56,RIFERIMENTI!$P$56:$P$70,RIFERIMENTI!$S$56:$S$70)),\"DIF\",LOOKUP(BB56,RIFERIMENTI!$P$56:$P$70,RIFERIMENTI!$S$56:$S$70)))","v":""},{"$f":"IF(BB56=\"\",\"\",IF(BC56=\"DIF\",0,VLOOKUP(E56,RIFERIMENTI!$H$2:$N$17,7,FALSE)))","v":""},null,{"$f":"IF(ISNA(VLOOKUP(BC56,'IND. AMM.NE'!$U$4:$V$26,2,FALSE)),\"DIFESA\",VLOOKUP(BC56,'IND. AMM.NE'!$U$4:$V$26,2,FALSE))","v":"DIFESA"},null,0]
[null,null,{"$f":"IF(RIFERIMENTI!$Q$31>0,\"\",RIFERIMENTI!AJ44)","v":""},{"$f":"IF(RIFERIMENTI!$Q$31>0,\"\",RIFERIMENTI!AK44)","v":""},{"$f":"IF(C57=\"\",\"\",IF(RIFERIMENTI!$Q$31=1,\"\",LOOKUP(C57,RIFERIMENTI!$V$49:$V$55,RIFERIMENTI!$W$49:$W$55)))","v":""},{"$f":"IF(C57=\"\",0,(LOOKUP(CONCATENATE(E57,\" \",C57),STIPENDIO!$B$5:$B$391,STIPENDIO!$H$5:$H$391))+(LOOKUP(CONCATENATE(E57,\" \",C57),'IND. INT. SPEC.'!$B$6:$B$39,'IND. INT. SPEC.'!$H$6:$H$39)))","v":0},{"$f":"IF(C57=\"\",0,IF(BC57=\"DIF\",LOOKUP(CONCATENATE(E57,\" \",C57),'IND. AMM.NE'!$C$6:$C$166,'IND. AMM.NE'!$L$6:$L$166),VLOOKUP(CONCATENATE(BC57,\" \",BB57),'IND. AMM.NE'!$A$171:$X$253,BD57,TRUE)))","v":0},{"$f":"IF(C57=\"\",0,LOOKUP(CONCATENATE(E57,\" \",C57),'CCNL 2019-2021'!$C$99:$C$130,'CCNL 2019-2021'!$J$99:$J$130))","v":0},{"$f":"IF(C57=\"\",0,LOOKUP(CONCATENATE(E57,\" \",C57),'VACANZA CONTR.LE'!$B$5:$B$300,'VACANZA CONTR.LE'!$J$5:$J$300))","v":0},0,0,0,0,null,0,null,"",null,null,null,null,null,null,null,null,null,null,null,null,null,null,null,null,"","","",0,{"$f":"IF(C57=\"\",0,LOOKUP(CONCATENATE(E57,\" \",C57),'IND. AMM.NE'!$C$6:$C$166,'IND. AMM.NE'!$L$6:$L$166))","v":0},0,0,0,0,0,0,0,0,0,0,0,null,0,null,null,"",{"$f":"IF(C57=\"\",\"\",IF(ISNA(LOOKUP(BB57,RIFERIMENTI!$P$56:$P$70,RIFERIMENTI!$S$56:$S$70)),\"DIF\",LOOKUP(BB57,RIFERIMENTI!$P$56:$P$70,RIFERIMENTI!$S$56:$S$70)))","v":""},{"$f":"IF(BB57=\"\",\"\",IF(BC57=\"DIF\",0,VLOOKUP(E57,RIFERIMENTI!$H$2:$N$17,7,FALSE)))","v":""},null,{"$f":"IF(ISNA(VLOOKUP(BC57,'IND. AMM.NE'!$U$4:$V$26,2,FALSE)),\"DIFESA\",VLOOKUP(BC57,'IND. AMM.NE'!$U$4:$V$26,2,FALSE))","v":"DIFESA"},null,0]
[null,null,{"$f":"IF(RIFERIMENTI!$Q$31>0,\"\",RIFERIMENTI!AJ45)","v":""},{"$f":"IF(RIFERIMENTI!$Q$31>0,\"\",RIFERIMENTI!AK45)","v":""},{"$f":"IF(C58=\"\",\"\",IF(RIFERIMENTI!$Q$31=1,\"\",LOOKUP(C58,RIFERIMENTI!$V$49:$V$55,RIFERIMENTI!$W$49:$W$55)))","v":""},{"$f":"IF(C58=\"\",0,(LOOKUP(CONCATENATE(E58,\" \",C58),STIPENDIO!$B$5:$B$391,STIPENDIO!$H$5:$H$391))+(LOOKUP(CONCATENATE(E58,\" \",C58),'IND. INT. SPEC.'!$B$6:$B$39,'IND. INT. SPEC.'!$H$6:$H$39)))","v":0},{"$f":"IF(C58=\"\",0,IF(BC58=\"DIF\",LOOKUP(CONCATENATE(E58,\" \",C58),'IND. AMM.NE'!$C$6:$C$166,'IND. AMM.NE'!$L$6:$L$166),VLOOKUP(CONCATENATE(BC58,\" \",BB58),'IND. AMM.NE'!$A$171:$X$253,BD58,TRUE)))","v":0},{"$f":"IF(C58=\"\",0,LOOKUP(CONCATENATE(E58,\" \",C58),'CCNL 2019-2021'!$C$99:$C$130,'CCNL 2019-2021'!$J$99:$J$130))","v":0},{"$f":"IF(C58=\"\",0,LOOKUP(CONCATENATE(E58,\" \",C58),'VACANZA CONTR.LE'!$B$5:$B$300,'VACANZA CONTR.LE'!$J$5:$J$300))","v":0},0,0,0,0,null,0,null,"",null,null,null,null,null,null,null,null,null,null,null,null,null,null,null,null,"","","",0,{"$f":"IF(C58=\"\",0,LOOKUP(CONCATENATE(E58,\" \",C58),'IND. AMM.NE'!$C$6:$C$166,'IND. AMM.NE'!$L$6:$L$166))","v":0},0,0,0,0,0,0,0,0,0,0,0,null,0,null,null,"",{"$f":"IF(C58=\"\",\"\",IF(ISNA(LOOKUP(BB58,RIFERIMENTI!$P$56:$P$70,RIFERIMENTI!$S$56:$S$70)),\"DIF\",LOOKUP(BB58,RIFERIMENTI!$P$56:$P$70,RIFERIMENTI!$S$56:$S$70)))","v":""},{"$f":"IF(BB58=\"\",\"\",IF(BC58=\"DIF\",0,VLOOKUP(E58,RIFERIMENTI!$H$2:$N$17,7,FALSE)))","v":""},null,{"$f":"IF(ISNA(VLOOKUP(BC58,'IND. AMM.NE'!$U$4:$V$26,2,FALSE)),\"DIFESA\",VLOOKUP(BC58,'IND. AMM.NE'!$U$4:$V$26,2,FALSE))","v":"DIFESA"},null,0]
[null,null,{"$f":"IF(RIFERIMENTI!$Q$31>0,\"\",RIFERIMENTI!AJ46)","v":""},{"$f":"IF(RIFERIMENTI!$Q$31>0,\"\",RIFERIMENTI!AK46)","v":""},{"$f":"IF(C59=\"\",\"\",IF(RIFERIMENTI!$Q$31=1,\"\",LOOKUP(C59,RIFERIMENTI!$V$49:$V$55,RIFERIMENTI!$W$49:$W$55)))","v":""},{"$f":"IF(C59=\"\",0,(LOOKUP(CONCATENATE(E59,\" \",C59),STIPENDIO!$B$5:$B$391,STIPENDIO!$H$5:$H$391))+(LOOKUP(CONCATENATE(E59,\" \",C59),'IND. INT. SPEC.'!$B$6:$B$39,'IND. INT. SPEC.'!$H$6:$H$39)))","v":0},{"$f":"IF(C59=\"\",0,IF(BC59=\"DIF\",LOOKUP(CONCATENATE(E59,\" \",C59),'IND. AMM.NE'!$C$6:$C$166,'IND. AMM.NE'!$L$6:$L$166),VLOOKUP(CONCATENATE(BC59,\" \",BB59),'IND. AMM.NE'!$A$171:$X$253,BD59,TRUE)))","v":0},{"$f":"IF(C59=\"\",0,LOOKUP(CONCATENATE(E59,\" \",C59),'CCNL 2019-2021'!$C$99:$C$130,'CCNL 2019-2021'!$J$99:$J$130))","v":0},{"$f":"IF(C59=\"\",0,LOOKUP(CONCATENATE(E59,\" \",C59),'VACANZA CONTR.LE'!$B$5:$B$300,'VACANZA CONTR.LE'!$J$5:$J$300))","v":0},0,0,0,0,null,0,null,"",null,null,null,null,null,null,null,null,null,null,null,null,null,null,null,null,"","","",0,{"$f":"IF(C59=\"\",0,LOOKUP(CONCATENATE(E59,\" \",C59),'IND. AMM.NE'!$C$6:$C$166,'IND. AMM.NE'!$L$6:$L$166))","v":0},0,0,0,0,0,0,0,0,0,0,0,null,0,null,null,"",{"$f":"IF(C59=\"\",\"\",IF(ISNA(LOOKUP(BB59,RIFERIMENTI!$P$56:$P$70,RIFERIMENTI!$S$56:$S$70)),\"DIF\",LOOKUP(BB59,RIFERIMENTI!$P$56:$P$70,RIFERIMENTI!$S$56:$S$70)))","v":""},{"$f":"IF(BB59=\"\",\"\",IF(BC59=\"DIF\",0,VLOOKUP(E59,RIFERIMENTI!$H$2:$N$17,7,FALSE)))","v":""},null,{"$f":"IF(ISNA(VLOOKUP(BC59,'IND. AMM.NE'!$U$4:$V$26,2,FALSE)),\"DIFESA\",VLOOKUP(BC59,'IND. AMM.NE'!$U$4:$V$26,2,FALSE))","v":"DIFESA"},null,0]
[null,null,{"$f":"IF(RIFERIMENTI!$Q$31>0,\"\",RIFERIMENTI!AJ47)","v":""},{"$f":"IF(RIFERIMENTI!$Q$31>0,\"\",RIFERIMENTI!AK47)","v":""},{"$f":"IF(C60=\"\",\"\",IF(RIFERIMENTI!$Q$31=1,\"\",LOOKUP(C60,RIFERIMENTI!$V$49:$V$55,RIFERIMENTI!$W$49:$W$55)))","v":""},{"$f":"IF(C60=\"\",0,(LOOKUP(CONCATENATE(E60,\" \",C60),STIPENDIO!$B$5:$B$391,STIPENDIO!$H$5:$H$391))+(LOOKUP(CONCATENATE(E60,\" \",C60),'IND. INT. SPEC.'!$B$6:$B$39,'IND. INT. SPEC.'!$H$6:$H$39)))","v":0},{"$f":"IF(C60=\"\",0,IF(BC60=\"DIF\",LOOKUP(CONCATENATE(E60,\" \",C60),'IND. AMM.NE'!$C$6:$C$166,'IND. AMM.NE'!$L$6:$L$166),VLOOKUP(CONCATENATE(BC60,\" \",BB60),'IND. AMM.NE'!$A$171:$X$253,BD60,TRUE)))","v":0},{"$f":"IF(C60=\"\",0,LOOKUP(CONCATENATE(E60,\" \",C60),'CCNL 2019-2021'!$C$99:$C$130,'CCNL 2019-2021'!$J$99:$J$130))","v":0},{"$f":"IF(C60=\"\",0,LOOKUP(CONCATENATE(E60,\" \",C60),'VACANZA CONTR.LE'!$B$5:$B$300,'VACANZA CONTR.LE'!$J$5:$J$300))","v":0},0,0,0,0,null,0,null,"",null,null,null,null,null,null,null,null,null,null,null,null,null,null,null,null,"","","",0,{"$f":"IF(C60=\"\",0,LOOKUP(CONCATENATE(E60,\" \",C60),'IND. AMM.NE'!$C$6:$C$166,'IND. AMM.NE'!$L$6:$L$166))","v":0},0,0,0,0,0,0,0,0,0,0,0,null,0,null,null,"",{"$f":"IF(C60=\"\",\"\",IF(ISNA(LOOKUP(BB60,RIFERIMENTI!$P$56:$P$70,RIFERIMENTI!$S$56:$S$70)),\"DIF\",LOOKUP(BB60,RIFERIMENTI!$P$56:$P$70,RIFERIMENTI!$S$56:$S$70)))","v":""},{"$f":"IF(BB60=\"\",\"\",IF(BC60=\"DIF\",0,VLOOKUP(E60,RIFERIMENTI!$H$2:$N$17,7,FALSE)))","v":""},null,{"$f":"IF(ISNA(VLOOKUP(BC60,'IND. AMM.NE'!$U$4:$V$26,2,FALSE)),\"DIFESA\",VLOOKUP(BC60,'IND. AMM.NE'!$U$4:$V$26,2,FALSE))","v":"DIFESA"},null,0]
[null,null,{"$f":"IF(RIFERIMENTI!$Q$31>0,\"\",RIFERIMENTI!AJ48)","v":""},{"$f":"IF(RIFERIMENTI!$Q$31>0,\"\",RIFERIMENTI!AK48)","v":""},{"$f":"IF(C61=\"\",\"\",IF(RIFERIMENTI!$Q$31=1,\"\",LOOKUP(C61,RIFERIMENTI!$V$49:$V$55,RIFERIMENTI!$W$49:$W$55)))","v":""},{"$f":"IF(C61=\"\",0,(LOOKUP(CONCATENATE(E61,\" \",C61),STIPENDIO!$B$5:$B$391,STIPENDIO!$H$5:$H$391))+(LOOKUP(CONCATENATE(E61,\" \",C61),'IND. INT. SPEC.'!$B$6:$B$39,'IND. INT. SPEC.'!$H$6:$H$39)))","v":0},{"$f":"IF(C61=\"\",0,IF(BC61=\"DIF\",LOOKUP(CONCATENATE(E61,\" \",C61),'IND. AMM.NE'!$C$6:$C$166,'IND. AMM.NE'!$L$6:$L$166),VLOOKUP(CONCATENATE(BC61,\" \",BB61),'IND. AMM.NE'!$A$171:$X$253,BD61,TRUE)))","v":0},{"$f":"IF(C61=\"\",0,LOOKUP(CONCATENATE(E61,\" \",C61),'CCNL 2019-2021'!$C$99:$C$130,'CCNL 2019-2021'!$J$99:$J$130))","v":0},{"$f":"IF(C61=\"\",0,LOOKUP(CONCATENATE(E61,\" \",C61),'VACANZA CONTR.LE'!$B$5:$B$300,'VACANZA CONTR.LE'!$J$5:$J$300))","v":0},0,0,0,0,null,0,null,"",null,null,null,null,null,null,null,null,null,null,null,null,null,null,null,null,"","","",0,{"$f":"IF(C61=\"\",0,LOOKUP(CONCATENATE(E61,\" \",C61),'IND. AMM.NE'!$C$6:$C$166,'IND. AMM.NE'!$L$6:$L$166))","v":0},0,0,0,0,0,0,0,0,0,0,0,null,0,null,null,"",{"$f":"IF(C61=\"\",\"\",IF(ISNA(LOOKUP(BB61,RIFERIMENTI!$P$56:$P$70,RIFERIMENTI!$S$56:$S$70)),\"DIF\",LOOKUP(BB61,RIFERIMENTI!$P$56:$P$70,RIFERIMENTI!$S$56:$S$70)))","v":""},{"$f":"IF(BB61=\"\",\"\",IF(BC61=\"DIF\",0,VLOOKUP(E61,RIFERIMENTI!$H$2:$N$17,7,FALSE)))","v":""},null,{"$f":"IF(ISNA(VLOOKUP(BC61,'IND. AMM.NE'!$U$4:$V$26,2,FALSE)),\"DIFESA\",VLOOKUP(BC61,'IND. AMM.NE'!$U$4:$V$26,2,FALSE))","v":"DIFESA"},null,0]
[null,null,{"$f":"IF(RIFERIMENTI!$Q$31>0,\"\",RIFERIMENTI!AJ49)","v":""},{"$f":"IF(RIFERIMENTI!$Q$31>0,\"\",RIFERIMENTI!AK49)","v":""},{"$f":"IF(C62=\"\",\"\",IF(RIFERIMENTI!$Q$31=1,\"\",LOOKUP(C62,RIFERIMENTI!$V$49:$V$55,RIFERIMENTI!$W$49:$W$55)))","v":""},{"$f":"IF(C62=\"\",0,(LOOKUP(CONCATENATE(E62,\" \",C62),STIPENDIO!$B$5:$B$391,STIPENDIO!$H$5:$H$391))+(LOOKUP(CONCATENATE(E62,\" \",C62),'IND. INT. SPEC.'!$B$6:$B$39,'IND. INT. SPEC.'!$H$6:$H$39)))","v":0},{"$f":"IF(C62=\"\",0,IF(BC62=\"DIF\",LOOKUP(CONCATENATE(E62,\" \",C62),'IND. AMM.NE'!$C$6:$C$166,'IND. AMM.NE'!$L$6:$L$166),VLOOKUP(CONCATENATE(BC62,\" \",BB62),'IND. AMM.NE'!$A$171:$X$253,BD62,TRUE)))","v":0},{"$f":"IF(C62=\"\",0,LOOKUP(CONCATENATE(E62,\" \",C62),'CCNL 2019-2021'!$C$99:$C$130,'CCNL 2019-2021'!$J$99:$J$130))","v":0},{"$f":"IF(C62=\"\",0,LOOKUP(CONCATENATE(E62,\" \",C62),'VACANZA CONTR.LE'!$B$5:$B$300,'VACANZA CONTR.LE'!$J$5:$J$300))","v":0},0,0,0,0,null,0,null,"",null,null,null,null,null,null,null,null,null,null,null,null,null,null,null,null,"","","",0,{"$f":"IF(C62=\"\",0,LOOKUP(CONCATENATE(E62,\" \",C62),'IND. AMM.NE'!$C$6:$C$166,'IND. AMM.NE'!$L$6:$L$166))","v":0},0,0,0,0,0,0,0,0,0,0,0,null,0,null,null,"",{"$f":"IF(C62=\"\",\"\",IF(ISNA(LOOKUP(BB62,RIFERIMENTI!$P$56:$P$70,RIFERIMENTI!$S$56:$S$70)),\"DIF\",LOOKUP(BB62,RIFERIMENTI!$P$56:$P$70,RIFERIMENTI!$S$56:$S$70)))","v":""},{"$f":"IF(BB62=\"\",\"\",IF(BC62=\"DIF\",0,VLOOKUP(E62,RIFERIMENTI!$H$2:$N$17,7,FALSE)))","v":""},null,{"$f":"IF(ISNA(VLOOKUP(BC62,'IND. AMM.NE'!$U$4:$V$26,2,FALSE)),\"DIFESA\",VLOOKUP(BC62,'IND. AMM.NE'!$U$4:$V$26,2,FALSE))","v":"DIFESA"},null,0]
[null,null,null,null,null,null,null,null,null,null,null,null," "]
[null,null,null,null,null,null,null,null,null,null,null," "]
[]
[null,null,null,null,null,null,null,null," ",null,null," "]
[]
[]
[]
[]
[]
[]
[]
[]
[]
[]
[]
[]
[null,null,null," "]
[]
[]
[null,null,null,null,null,null,null,null,null,null,null,null,null,null," "]

{"sheet":"STIPENDIO","index":2,"n_rows":391,"n_cols":42,"rows_kept":391,"cut":false,"hidden":true,"merged":[[281,13,281,14],[281,15,281,16],[279,13,279,14],[276,13,276,14],[277,13,277,14],[278,13,278,14],[279,15,279,16],[280,13,280,14],[280,15,280,16],[23,24,23,29],[1,3,1,8],[4,13,4,14],[2,15,2,19],[225,12,225,13],[225,14,225,15],[2,20,2,41],[24,26,24,29],[23,34,23,36],[25,31,26,31],[25,32,26,32],[24,36,26,36],[23,31,24,33],[25,33,26,33],[24,34,25,34],[24,35,25,35],[226,12,226,13],[227,12,227,13],[228,12,228,13],[229,12,229,13],[230,12,230,13],[237,12,237,13],[238,12,238,13],[232,14,232,15],[233,14,233,15],[234,14,234,15],[235,14,235,15],[236,14,236,15],[237,14,237,15],[238,14,238,15],[232,12,232,13],[233,12,233,13],[234,12,234,13],[235,12,235,13],[236,12,236,13],[227,14,227,15],[228,14,228,15],[229,14,229,15],[230,14,230,15],[231,12,231,13],[231,14,231,15],[282,15,282,16],[283,15,283,16],[282,13,282,14],[283,13,283,14],[269,13,269,14],[271,13,271,14],[271,15,271,16],[272,13,272,14],[272,15,272,16],[274,13,274,14],[274,15,274,16],[275,13,275,14],[275,15,275,16],[276,15,276,16],[277,15,277,16],[278,15,278,16],[226,14,226,15],[290,12,290,16],[314,12,314,17],[270,13,270,14],[270,15,270,16],[273,13,273,14],[273,15,273,16],[265,15,265,16],[266,15,266,16],[267,15,267,16],[268,15,268,16],[269,15,269,16],[265,13,265,14],[266,13,266,14],[267,13,267,14],[268,13,268,14]]}
[]
[null,null,null,"STIPENDIO SENZA I.I.S."]
[null,null,null,"DAL","AL","POS. ECON.","FASCE NELLE AREE","ANNUO LORDO","MENSILE LORDO",null,null,null,null,null,null,"£IRE",null,null,null,null,"€uro"]
[null,null,null,"A1","A1F1"]
[null,{"$f":"CONCATENATE(G5,\" (\",F5,\") \",D5)","v":"A1F1 (A1) 35977"},null,"1998-07-01","1998-10-31","A1","A1F1",{"$f":"ROUND(K5/1936.27,2)","v":5925.31},{"$f":"ROUND(H5/12,2)","v":493.78},null,11473000,null,null,"DAL ",null,"1998-07-01","1998-11-01","1999-06-01","2000-07-01","2001-01-01","2002-01-01","2003-01-01","2004-01-01","2005-02-01","2015-12-31","2006-01-01","2007-01-01","2007-02-01","2007-12-31","2008-01-01","2009-01-01","2010-04-01","2010-07-01","2016-01-01","2017-01-01","2018-03-01","2018-04-01","2019-01-01","2020-01-01","2021-01-01","2022-07-01","2022-10-01"]
[null,{"$f":"CONCATENATE(G6,\" (\",F6,\") \",D6)","v":"A1F1 (A1) 36100"},null,"1998-11-01","1999-05-31","A1","A1F1",{"$f":"ROUND(K6/1936.27,2)","v":6142.22},{"$f":"ROUND(H6/12,2)","v":511.85},null,11893000]
[null,"A1F1 (A1) 36312",null,"1999-06-01","2000-06-30","A1","A1F1",6321.95,526.83000000000004,null,12241000,null,null,"A1","A1 F1",11473000,11893000,12241000,12601000,13213000,7194.75,13843.31,14229.09,14727.59,14768.65,14850.61,15189.01,15682.93,15682.93,15770.65,16384.57,16384.57,16384.57,16460.169999999998,16614.97,17140.57,17263.45,17417.05,17574.25,18019.45,18243.61,18255.88]
[null,"A1F1 (A1) 36708",null,"2000-07-01","2000-12-31","A1","A1F1",6507.87,542.32000000000005,null,12601000,null,null,"A1S","A1F2",12500000,12920000,13268000,13628000,14240000,7725.15,14373.71,14759.49,15257.99,"15.299.05",15384.01,15734.53,16246.21,16246.21,16337.05,16973.05,16973.05,16973.05,17052.25,17211.849999999999,17741.05,17868.349999999999,18026.75,18189.95,18636.349999999999,18864.71,18876.98]
[null,"A1F1 (A1) 36892",null,"2001-01-01","2001-12-31","A1","A1F1",6823.95,568.66,null,13213000,null,null,null,"A1F3",null,null,null,null,null,null,null,null,null,null,null,null,null,16846.21,16938.849999999999,17599.93,17599.93,17599.93,17681.53,17847.13,18391.93,18523.93,18688.330000000002,18857.53,19315.93,19550.650000000001,19562.920000000002]
[null,"A1F1 (A1) 37257",null,"2002-01-01","2002-12-31","A1","A1F1",{"$f":"K10","v":7194.75},599.55999999999995,null,7194.75,null,null,"B1","A2F1",12703000,13147000,13519000,13903000,14551000,7906.16,14619.38,15026.79,15553.23,15596.59,15683.11,16040.47,16562.11,16562.11,16654.75,17303.11,17303.11,17303.11,17383.509999999998,17545.509999999998,18073.509999999998,18203.28,18365.28,18530.88,18973.68,19202.04,19214.54]
[null,"A1F1 (A1) 37622",null,"2003-01-01","2003-12-31","A1","A1F1",{"$f":"K11-VLOOKUP(G11,$AB$26:$AC$43,2,FALSE)","v":7607.5499999999993},633.96,null,13843.31,null,null,"B2","A2F2",13921000,14389000,14773000,15181000,15853000,8598.99,15375.22,15803.69,16357.35,16402.95,16494.03,16869.87,17418.39,17418.39,17515.830000000002,18197.669999999998,18197.669999999998,18197.669999999998,18281.669999999998,18453.27,18995.669999999998,19132.150000000001,19302.55,19476.55,19930.150000000001,20167.030000000002,20179.530000000002]
[null,"A1F1 (A1) 37987",null,"2004-01-01","2005-01-31","A1","A1F1",7993.33,666.11,null,14229.09,null,null,"B3","A2F3",15447000,15951000,16371000,16803000,17523000,9487.8700000000008,16346.23,16801.759999999998,17390.39,17438.87,17535.71,17929.189999999999,18530.990000000002,18530.990000000002,18634.669999999998,19372.07,19372.07,19372.07,19462.07,19644.47,20213.27,20358.560000000001,20539.759999999998,20725.759999999998,21199.759999999998,21449.359999999997,21461.859999999997]
[null,"A1F1 (A1) 38384",null,"2005-02-01","2005-12-30","A1","A1F1",8491.83,707.65,null,14727.59,null,null,"B3S","A2F4",17500000,18004000,18424000,18856000,19576000,10548.16,17406.52,17862.05,18450.68,18499.16,18601.88,19022.12,19638.439999999999,19638.439999999999,19748.240000000002,20517.080000000002,20517.080000000002,20517.080000000002,20611.88,20805.080000000002,21441.08,21594.959999999999,21786.959999999999,21983.759999999998,22518.959999999999,22793.040000000001,22805.54]
[null,"A1F1 (A1) 38717",null,"2005-12-31","2005-12-31","A1","A1F1",8532.89,711.07,null,14768.65,null,null,null,"A2F5",null,null,null,null,null,null,null,null,null,null,null,null,null,20301.11,20414.63,21209.39,21209.39,21209.39,21307.79,21506.99,22218.59,22377.66,22576.86,22780.86,23386.86,23386.86,23399.360000000001]
[null,"A1F1 (A1) 38718",null,"2006-01-01","2006-12-31","A1","A1F1",8614.85,717.9,null,14850.61,null,null,null,"A2F6",null,null,null,null,null,null,null,null,null,null,null,null,null,20888.3,21005.06,21822.86,21822.86,21822.86,21923.66,22128.86,22851.26,23014.93,23220.13,23430.13,24043.33,24043.33,24055.83]
[null,"A1F1 (A1) 39083",null,"2007-01-01","2007-01-31","A1","A1F1",8953.25,746.1,null,15189.01,null,null,"C1","A3F1",17879000,18419000,18875000,19343000,20135000,10876.46,17855.12,18352.7,18995.66,19048.62,19154.34,19587.18,20220.66,20220.66,20333.7,21125.34,21125.34,21125.34,21223.74,21421.74,22133.34,22291.78,22489.78,22693.78,23299.78,23299.78,23316.629999999997]
[null,"A1F1 (A1) 39114",null,"2007-02-01","2007-12-30","A1","A1F1",9447.17,787.26,null,15682.93,null,null,"C1S","A3F2",19200000,19740000,20196000,20664000,21456000,11558.7,18537.36,19034.939999999999,19677.900000000001,19730.86,19840.419999999998,20287.66,20943.939999999999,20943.939999999999,21061.06,21880.9,21880.9,21880.9,21982.9,22188.1,22910.5,23074.61,23279.81,23489.81,24104.21,24104.21,24121.059999999998]
[null,"A1F1 (A1) 39447",null,"2007-12-31","2007-12-31",{"$f":"F17","v":"A1"},{"$f":"G17","v":"A1F1"},9447.17,787.26,null,15682.93,null,null,"C2","A3F3",20571000,21159000,21651000,22167000,23031000,12417.72,19546.16,20090.87,20794.72,20852.7,20968.38,21441.42,22134.06,22134.06,22257.78,23112.3,23112.3,23112.3,23219.1,23436.3,24156.3,24329.64,24545.64,24767.64,25373.64,25373.64,25390.489999999998]
[null,"A1F1 (A1) 39448",null,"2008-01-01","2008-12-31","A1","A1F1",9534.89,794.57,null,15770.65,null,null,"C3","A3F4",23639000,24299000,24851000,25415000,26363000,14190.15,21472.38,22070.77,22843.98,22907.68,23034.87,23553.63,24315.03,24315.03,24450.99,25388.43,25388.43,25388.43,25506.03,25744.83,26528.43,26718.84,26956.44,27200.04,27858.84,27858.84,27875.69]
[null,"A1F1 (A1) 39814",null,"2009-01-01","2010-03-31","A1","A1F1",10148.81,845.73,null,16384.57,null,null,"C3S","A3F5",26500000,27160000,27712000,28276000,29224000,15667.74,22949.97,23548.36,24321.57,"24,385,26",24520.62,25073.34,25882.86,25882.86,26027.58,27040.86,27040.86,27040.86,27165.66,27420.06,28246.86,28449.67,28702.87,28962.07,29655.67,29655.67,29672.519999999997]
[null,"A1F1 (A1) 40269",null,"2010-04-01","2010-06-30",{"$f":"F20","v":"A1"},"A1F1",10148.81,845.73,null,16384.57,null,null,null,"A3F6",null,null,null,null,null,null,null,null,null,null,null,null,null,27643.68,27798.240000000002,28880.400000000001,28880.400000000001,28880.400000000001,29014.799999999999,29286,30152.400000000001,30369,30639,30916.2,31641,31641,31657.85]
[null,"A1F1 (A1) 40360",null,"2010-07-01","2015-12-31","A1","A1F1",10148.81,845.73,null,16384.57,null,null,null,"A3F7",null,null,null,null,null,null,null,null,null,null,null,null,null,29336.18,29500.22,30648.62,30648.62,30648.62,30790.22,31079.42,32016.62,32246.48,32533.279999999999,32827.279999999999,33614.480000000003,33614.480000000003,33631.33]
[null,"A1F1 (A1) 42370",null,"2016-01-01","2016-12-31",{"$f":"F22","v":"A1"},{"$f":"G22","v":"A1F1"},10224.409999999998,852.03,null,16460.169999999998]
[null,"A1F1 (A1) 42736",null,"2017-01-01","2018-02-28",{"$f":"F23","v":"A1"},{"$f":"G23","v":"A1F1"},10379.210000000001,864.93,null,16614.97,null,null,null,null,null,null,null,null,null,null,null," ",null,"IND. INT. SPECIALE FINO AL 31 OTTOBRE 2022 ",null,null,null,null,null,null,"TABELLARI NOIPA\nDAL 01.11.2022",null,null,"DAL 1° NOVEMBRE 2022"]
[null,"A1F1 (A1) 43160",null,"2018-03-01","2018-03-31","A1","A1F1",10904.81,908.73,null,17140.57,null,null,null,null," ",null,null,null,null,null,null,null,null,"A","A1","CCNL_INTEGRATIVO_16-05-2001",null,null,null,null,null,null,null,"ART. 52\nCCNL 19 - 21","CCNL INT. 16.05.2001","TOTALE ANNUO"]
[null,"A1F1 (A1) 43191",null,"2018-04-01","2018-12-31","A1","A1F1",11027.69,918.97,null,17263.45,null,null,null,null," ",null,null,null,null,null,null,null,null,"1991-11-01","9999-01-01","A1","A1F1",6235.76,519.65,null,"AREA","FASCIA\nRETRIBUTIVA","AREA/\nFASCIA"]
[null,"A1F1 (A1) 43466",null,"2019-01-01","2019-12-31","A1","A1F1",11181.289999999999,{"$f":"ROUND(H27/12,2)","v":931.77},null,{"$f":"HLOOKUP(G27,'CCNL 2019-2021'!$M$22:$AB$27,'CCNL 2019-2021'!$K$23,FALSE)","v":17417.05},null,null,null,null,null,null,null,null,null,null,null,null,null,"1991-11-01","9999-01-01","A1S","A1F2",6235.76,519.65,null,null,null,null,"STIPENDIO","IND. INT. SPEC."]
[null,"A1F1 (A1) 43831",null,"2020-01-01","2020-12-31","A1","A1F1",11338.49,944.87,null,{"$f":"HLOOKUP(G28,'CCNL 2019-2021'!$M$22:$AB$27,'CCNL 2019-2021'!$K$24,FALSE)","v":17574.25},null,null,null,null,null,null,null,null,null,null,null,null,null,"2007-12-31","9999-01-01","--------","A1F3",6235.76,519.65,null,"FUNZIONARI","F7","A3F7",16860.48,6641.4,23501.879999999997]
[null,"A1F1 (A1) 44197",null,"2021-01-01","2022-06-30","A1","A1F1",11783.69,981.97,null,{"$f":"HLOOKUP(G29,'CCNL 2019-2021'!$M$22:$AB$27,'CCNL 2019-2021'!$K$25,FALSE)","v":18019.45},null,null,null,null,null,null,null,null,null,null,null,null,null,"B","A2",null,null,null,null,null,"FUNZIONARI","F6","A3F6",16860.48,6641.4,23501.879999999997]
[null,"A1F1 (A1) 44743",null,"2022-07-01","2022-10-31","A1","A1F1",12007.85,{"$f":"ROUND(H30/12,2)","v":1000.65},null,{"$f":"HLOOKUP(G30,'CCNL 2019-2021'!$M$22:$AB$27,'CCNL 2019-2021'!$K$26,FALSE)","v":18243.61},null,null,null,null,null,null,null,null,null,null,null,null,null,"1991-11-01","9999-01-01","B1","A2F1",6277.62,523.14,null,"FUNZIONARI","F5","A3F5",16860.48,6641.4,23501.879999999997]
[null,"A1F1 (A1) 44866",null,"2022-11-01","9999-01-01","A1","A1F1",{"$f":"VLOOKUP(G31,$AH$28:$AI$43,2,FALSE)","v":12155.04},1012.92,null,null,null,null,null,null,null,null,null,null,null,null,null,null,null,"1991-11-01","9999-01-01","B2","A2F2",6317.83,526.49,null,"FUNZIONARI","F4","A3F4",16860.48,6641.4,23501.879999999997]
[null,null,null,"A1S","A1F2",null,null,null,null,null,null,null,null,null,null,null,null,null,null,null,null,null,null,null,"1991-11-01","9999-01-01","B3","A2F3",6371.04,530.91999999999996,null,"FUNZIONARI","F3","A3F3",16956.599999999999,6545.28,23501.879999999997]
[null,{"$f":"CONCATENATE(G33,\" (\",F33,\") \",D33)","v":"A1F2 (A1S) 35977"},null,"1998-07-01","1998-10-31","A1S","A1F2",{"$f":"ROUND(K33/1936.27,2)","v":6455.71},{"$f":"ROUND(H33/12,2)","v":537.98},null,12500000,null,null,null,null,null,null,null,null,null,null,null,null,null,"1991-11-01","9999-01-01","B3S","A2F4",6371.04,530.91999999999996,null,"FUNZIONARI","F2","A3F2",17056.080000000002,6445.8,23501.88]
[null,"A1F2 (A1S) 36100",null,"1998-11-01","1999-05-31","A1S","A1F2",{"$f":"ROUND(K34/1936.27,2)","v":6672.62},556.04999999999995,null,12920000,null," ",null," ",null,null,null,null,null,null,null,null,null,"2007-12-31","9999-01-01","--------","A2F5",6371.04,530.91999999999996,null,"FUNZIONARI","F1","A3F1",17056.080000000002,6445.8,23501.88]
[null,"A1F2 (A1S) 36312",null,"1999-06-01","2000-06-30","A1S","A1F2",6852.35,571.03,null,13268000,null,null," ",null,null,null,null,null,null,null,null,null,null,"2007-12-31","9999-01-01","--------","A2F6",6371.04,530.91999999999996,null,"ASSISTENTI","F6","A2F6",12980.88,6371.04,19351.919999999998]
[null,"A1F2 (A1S) 36708",null,"2000-07-01","2000-12-31","A1S","A1F2",7038.27,586.52,null,13628000,null,null,null,null,null,null,null,null,null,null,null,null,null,"C","A3",null,null,null,null,null,"ASSISTENTI","F5","A2F5",12980.88,6371.04,19351.919999999998]
[null,"A1F2 (A1S) 36892",null,"2001-01-01","2001-12-31","A1S","A1F2",7354.35,612.86,null,14240000,null,null,null,null,null,null,null,null,null,null,null,null,null,"1991-11-01","9999-01-01","C1","A3F1",6445.86,537.16,null,"ASSISTENTI","F4","A2F4",12980.88,6371.04,19351.919999999998]
[null,"A1F2 (A1S) 37257",null,"2002-01-01","2002-12-31","A1S","A1F2",{"$f":"K38","v":7725.15},643.76,null,7725.15,null,null,null,null,null,null,null,null,null,null,null,null,null,"1991-11-01","9999-01-01","C1S","A3F2",6445.86,537.16,null,"ASSISTENTI","F3","A2F3",12980.88,6371.04,19351.919999999998]
[null,"A1F2 (A1S) 37622",null,"2003-01-01","2003-12-31","A1S","A1F2",{"$f":"K39-VLOOKUP(G39,$AB$26:$AC$43,2,FALSE)","v":8137.9499999999989},678.16,null,14373.71,null,null,null,null,null,null,null,null,null,null,null,null,null,"1991-11-01","9999-01-01","C2","A3F3",6545.23,545.44000000000005,null,"ASSISTENTI","F2","A2F2",13034.04,6317.88,19351.920000000002]
[null,"A1F2 (A1S) 37987",null,"2004-01-01","2005-01-31","A1S","A1F2",8523.73,710.31,null,14759.49,null,null,null,null,null,null,null,null,null,null,null,null,null,"1991-11-01","9999-01-01","C3","A3F4",6641.43,553.45000000000005,null,"ASSISTENTI","F1","A2F1",13074.36,6277.56,19351.920000000002]
[null,"A1F2 (A1S) 38384",null,"2005-02-01","2005-12-30","A1S","A1F2",9022.23,751.85,null,15257.99,null,null,null,null,null,null,null,null,null,null,null,null,null,"1991-11-01","9999-01-01","C3S","A3F5",6641.43,553.45000000000005,null,"OPERATORI","F3","A1F3",12155.04,6235.8,18390.84]
[null,"A1F2 (A1S) 38717",null,"2005-12-31","2005-12-31","A1S","A1F2",9063.2899999999991,755.27,null,15299.05,null,null,null,null,null,null,null,null,null,null,null,null,null,"2007-12-31","9999-01-01","--------","A3F6",6641.43,553.45000000000005,null,"OPERATORI","F2","A1F2",12155.04,6235.8,18390.84]
[null,"A1F2 (A1S) 38718",null,"2006-01-01","2006-12-31","A1S","A1F2",9148.25,762.35,null,15384.01,null,null,null,null,null,null,null,null,null,null,null,null,null,"2007-12-31","9999-01-01","--------","A3F7",6641.43,553.45000000000005,null,"OPERATORI","F1","A1F1",12155.04,6235.8,18390.84]
[null,"A1F2 (A1S) 39083",null,"2007-01-01","2007-01-31","A1S","A1F2",9498.77,791.56,null,15734.53,null,null,null,null,null,null,null,null,null,null,null,null,null,null,null,null,null,null,null,null,null,null,null,null,null,null," "," "," "," "," "]
[null,"A1F2 (A1S) 39114",null,"2007-02-01","2007-12-30","A1S","A1F2",10010.449999999999,834.2,null,16246.21,null,null,null,null,null,null,null,null,null,null,null,null,null,null,null,null,null,null,null,null,null,null,null,null,null,null," "," "," "," "," "]
[null,"A1F2 (A1S) 39447",null,"2007-12-31","2007-12-31","A1S",{"$f":"G45","v":"A1F2"},10010.449999999999,834.2,null,16246.21,null,null,null,null,null,null,null,null,null,null,null,null,null,null,null,null,null,null,null,null,null,null,null,null,null,null,null," "," "," "," "]
[null,"A1F2 (A1S) 39448",null,"2008-01-01","2008-12-31","A1S","A1F2",10101.289999999999,841.77,null,16337.05]
[null,"A1F2 (A1S) 39814",null,"2009-01-01","2010-03-31","A1S","A1F2",10737.289999999999,894.77,null,16973.05]
[null,"A1F2 (A1S) 40269",null,"2010-04-01","2010-06-30","A1S",{"$f":"G48","v":"A1F2"},10737.289999999999,894.77,null,16973.05]
[null,"A1F2 (A1S) 40360",null,"2010-07-01","2015-12-31","A1S","A1F2",10737.289999999999,894.77,null,16973.05]
[null,"A1F2 (A1S) 42370",null,"2016-01-01","2016-12-31","A1S",{"$f":"G50","v":"A1F2"},10816.49,901.37,null,17052.25]
[null,"A1F2 (A1S) 42736",null,"2017-01-01","2018-02-28","A1S",{"$f":"G51","v":"A1F2"},10976.089999999998,914.67,null,17211.849999999999]
[null,"A1F2 (A1S) 43160",null,"2018-03-01","2018-03-31","A1S",{"$f":"G52","v":"A1F2"},11505.289999999999,958.77,null,17741.05]
[null,"A1F2 (A1S) 43191",null,"2018-04-01","2018-12-31",{"$f":"F53","v":"A1S"},"A1F2",11632.589999999998,969.38,null,17868.349999999999]
[null,"A1F2 (A1S) 43466",null,"2019-01-01","2019-12-31",{"$f":"F54","v":"A1S"},"A1F2",11790.99,{"$f":"ROUND(H55/12,2)","v":982.58},null,{"$f":"HLOOKUP(G55,'CCNL 2019-2021'!$M$22:$AB$27,'CCNL 2019-2021'!$K$23,FALSE)","v":18026.75}]
[null,"A1F2 (A1S) 43831",null,"2020-01-01","2020-12-31",{"$f":"F55","v":"A1S"},"A1F2",11954.19,996.18,null,{"$f":"HLOOKUP(G56,'CCNL 2019-2021'!$M$22:$AB$27,'CCNL 2019-2021'!$K$24,FALSE)","v":18189.95}]
[null,"A1F2 (A1S) 44197",null,"2021-01-01","2022-06-30",{"$f":"F56","v":"A1S"},"A1F2",12400.589999999998,1033.3800000000001,null,{"$f":"HLOOKUP(G57,'CCNL 2019-2021'!$M$22:$AB$27,'CCNL 2019-2021'!$K$25,FALSE)","v":18636.349999999999}]
[null,"A1F2 (A1S) 44743",null,"2022-07-01","2022-10-31",{"$f":"F57","v":"A1S"},"A1F2",12628.949999999999,1052.4100000000001,null,{"$f":"HLOOKUP(G58,'CCNL 2019-2021'!$M$22:$AB$27,'CCNL 2019-2021'!$K$26,FALSE)","v":18864.71}]
[null,"A1F2 (A1S) 44866",null,"2022-11-01","9999-01-01","A1S","A1F2",{"$f":"VLOOKUP(G59,$AH$28:$AI$43,2,FALSE)","v":12155.04},1012.92]
[null,null,null,"--------","A1F3"]
[null,{"$f":"CONCATENATE(G61,\" \",D61)","v":"A1F3 36100"},null,"1998-11-01","2007-12-30","--------","A1F3",0,{"$f":"ROUND(H61/12,2)","v":0}]
[null,{"$f":"CONCATENATE(G62,\" \",D62)","v":"A1F3 39447"},null,"2007-12-31","2007-12-31","--------","A1F3",{"$f":"K62-VLOOKUP(G62,$AB$26:$AC$43,2,FALSE)","v":10610.449999999999},884.2,null,16846.21]
[null,"A1F3 39448",null,"2008-01-01","2008-12-31","--------","A1F3",10703.089999999998,891.92,null,16938.849999999999]
[null,"A1F3 39814",null,"2009-01-01","2010-03-31","--------","A1F3",11364.17,947.01,null,17599.93]
[null,"A1F3 40269",null,"2010-04-01","2010-06-30",{"$f":"F64","v":"--------"},"A1F3",11364.17,947.01,null,17599.93]
[null,"A1F3 40360",null,"2010-07-01","2015-12-31","--------","A1F3",11364.17,947.01,null,17599.93]
[null,"A1F3 42370",null,"2016-01-01","2016-12-31",{"$f":"F66","v":"--------"},{"$f":"G66","v":"A1F3"},11445.769999999999,953.81,null,17681.53]
[null,"A1F3 42736",null,"2017-01-01","2018-02-28",{"$f":"F67","v":"--------"},{"$f":"G67","v":"A1F3"},11611.37,967.61,null,17847.13]
[null,"A1F3 43160",null,"2018-03-01","2018-03-31","--------","A1F3",12156.17,1013.01,null,18391.93]
[null,"A1F3 43191",null,"2018-04-01","2018-12-31","--------","A1F3",12288.17,1024.01,null,18523.93]
[null,"A1F3 43466",null,"2019-01-01","2019-12-31","--------","A1F3",12452.570000000002,{"$f":"ROUND(H71/12,2)","v":1037.71},null,{"$f":"HLOOKUP(G71,'CCNL 2019-2021'!$M$22:$AB$27,'CCNL 2019-2021'!$K$23,FALSE)","v":18688.330000000002}]
[null,"A1F3 43831",null,"2020-01-01","2020-12-31","--------","A1F3",12621.769999999999,1051.81,null,{"$f":"HLOOKUP(G72,'CCNL 2019-2021'!$M$22:$AB$27,'CCNL 2019-2021'!$K$24,FALSE)","v":18857.53}]
[null,"A1F3 44197",null,"2021-01-01","2022-06-30","--------","A1F3",13080.17,1090.01,null,{"$f":"HLOOKUP(G73,'CCNL 2019-2021'!$M$22:$AB$27,'CCNL 2019-2021'!$K$25,FALSE)","v":19315.93}]
[null,"A1F3 44743",null,"2022-07-01","2022-10-31","--------","A1F3",13314.890000000001,1109.57,null,{"$f":"HLOOKUP(G74,'CCNL 2019-2021'!$M$22:$AB$27,'CCNL 2019-2021'!$K$26,FALSE)","v":19550.650000000001}]
[null,"A1F3 44866",null,"2022-11-01","9999-01-01","--------","A1F3",{"$f":"VLOOKUP(G75,$AH$28:$AI$43,2,FALSE)","v":12155.04},1012.92]
[null,null,null,"B1","A2F1"]
[null,{"$f":"CONCATENATE(G77,\" (\",F77,\") \",D77)","v":"A2F1 (B1) 35977"},null,"1998-07-01","1998-10-31","B1","A2F1",{"$f":"ROUND(K77/1936.27,2)","v":6560.55},{"$f":"ROUND(H77/12,2)","v":546.71},null,12703000]
[null,"A2F1 (B1) 36100",null,"1998-11-01","1999-05-31","B1","A2F1",{"$f":"ROUND(K78/1936.27,2)","v":6789.86},565.82000000000005,null,13147000]
[null,"A2F1 (B1) 36312",null,"1999-06-01","2000-06-30","B1","A2F1",6981.98,581.83000000000004,null,13519000]
[null,"A2F1 (B1) 36708",null,"2000-07-01","2000-12-31","B1","A2F1",7180.3,598.36,null,13903000]
[null,"A2F1 (B1) 36892",null,"2001-01-01","2001-12-31","B1","A2F1",7514.96,626.25,null,14551000]
[null,"A2F1 (B1) 37257",null,"2002-01-01","2002-12-31","B1","A2F1",{"$f":"K82","v":7906.16},658.85,null,7906.16]
[null,"A2F1 (B1) 37622",null,"2003-01-01","2003-12-31","B1","A2F1",{"$f":"K83-VLOOKUP(G83,$AB$26:$AC$43,2,FALSE)","v":8341.7599999999984},695.15,null,14619.38]
[null,"A2F1 (B1) 37987",null,"2004-01-01","2005-01-31","B1","A2F1",8749.1700000000019,729.1,null,15026.79,null,null," "]
[null,"A2F1 (B1) 38384",null,"2005-02-01","2005-12-30","B1","A2F1",9275.61,772.97,null,15553.23]
[null,"A2F1 (B1) 38717",null,"2005-12-31","2005-12-31","B1","A2F1",9318.9700000000012,776.58,null,15596.59]
[null,"A2F1 (B1) 38718",null,"2006-01-01","2006-12-31","B1","A2F1",9405.4900000000016,783.79,null,15683.11]
[null,"A2F1 (B1) 39083",null,"2007-01-01","2007-01-31","B1","A2F1",9762.8499999999985,813.57,null,16040.47]
[null,"A2F1 (B1) 39114",null,"2007-02-01","2007-12-30","B1","A2F1",10284.490000000002,857.04,null,16562.11]
[null,"A2F1 (B1) 39447",null,"2007-12-31","2007-12-31",{"$f":"F89","v":"B1"},{"$f":"G89","v":"A2F1"},10284.490000000002,857.04,null,16562.11]
[null,"A2F1 (B1) 39448",null,"2008-01-01","2008-12-31","B1","A2F1",10377.130000000001,864.76,null,16654.75]
[null,"A2F1 (B1) 39814",null,"2009-01-01","2010-03-31","B1","A2F1",11025.490000000002,918.79,null,17303.11]
[null,"A2F1 (B1) 40269",null,"2010-04-01","2010-06-30",{"$f":"F92","v":"B1"},"A2F1",11025.490000000002,918.79,null,17303.11]
[null,"A2F1 (B1) 40360",null,"2010-07-01","2015-12-31","B1","A2F1",11025.490000000002,918.79,null,17303.11]
[null,"A2F1 (B1) 42370",null,"2016-01-01","2016-12-31",{"$f":"F94","v":"B1"},{"$f":"G94","v":"A2F1"},11105.89,925.49,null,17383.509999999998]
[null,"A2F1 (B1) 42736",null,"2017-01-01","2018-02-28",{"$f":"F95","v":"B1"},{"$f":"G95","v":"A2F1"},11267.89,938.99,null,17545.509999999998]
[null,"A2F1 (B1) 43160",null,"2018-03-01","2018-03-31","B1","A2F1",11795.89,982.99,null,18073.509999999998]
[null,"A2F1 (B1) 43191",null,"2018-04-01","2018-12-31","B1","A2F1",11925.66,993.81,null,18203.28]
[null,{"$f":"CONCATENATE(G99,\" (\",F99,\") \",D99)","v":"A2F1 (B1) 43466"},null,"2019-01-01","2019-12-31","B1","A2F1",12087.66,1007.31,null,{"$f":"HLOOKUP(G99,'CCNL 2019-2021'!$M$22:$AB$27,'CCNL 2019-2021'!$K$23,FALSE)","v":18365.28}]
[null,"A2F1 (B1) 43831",null,"2020-01-01","2020-12-31","B1","A2F1",12253.260000000002,1021.11,null,{"$f":"HLOOKUP(G100,'CCNL 2019-2021'!$M$22:$AB$27,'CCNL 2019-2021'!$K$24,FALSE)","v":18530.88}]
[null,"A2F1 (B1) 44197",null,"2021-01-01","2022-06-30","B1","A2F1",12696.060000000001,1058.01,null,{"$f":"HLOOKUP(G101,'CCNL 2019-2021'!$M$22:$AB$27,'CCNL 2019-2021'!$K$25,FALSE)","v":18973.68}]
[null,"A2F1 (B1) 44743",null,"2022-07-01","2022-10-31","B1","A2F1",12924.420000000002,1077.04,null,{"$f":"HLOOKUP(G102,'CCNL 2019-2021'!$M$22:$AB$27,'CCNL 2019-2021'!$K$26,FALSE)","v":19202.04}]
[null,"A2F1 (B1) 44866",null,"2022-11-01","9999-01-01","B1","A2F1",{"$f":"VLOOKUP(G103,$AH$28:$AI$43,2,FALSE)","v":13074.36},1089.53]
[null,null,null,"B2","A2F2"]
[null,{"$f":"CONCATENATE(G105,\" (\",F105,\") \",D105)","v":"A2F2 (B2) 35977"},null,"1998-07-01","1998-10-31","B2","A2F2",{"$f":"ROUND(K105/1936.27,2)","v":7189.6},{"$f":"ROUND(H105/12,2)","v":599.13},null,13921000]
[null,"A2F2 (B2) 36100",null,"1998-11-01","1999-05-31","B2","A2F2",{"$f":"ROUND(K106/1936.27,2)","v":7431.3},619.28,null,14389000]
[null,"A2F2 (B2) 36312",null,"1999-06-01","2000-06-30","B2","A2F2",7629.62,635.79999999999995,null,14773000]
[null,"A2F2 (B2) 36708",null,"2000-07-01","2000-12-31","B2","A2F2",7840.33,653.36,null,15181000]
[null,"A2F2 (B2) 36892",null,"2001-01-01","2001-12-31","B2","A2F2",8187.39,682.28,null,15853000]
[null,"A2F2 (B2) 37257",null,"2002-01-01","2002-12-31","B2","A2F2",{"$f":"K110","v":8598.99},716.58,null,8598.99]
[null,"A2F2 (B2) 37622",null,"2003-01-01","2003-12-31","B2","A2F2",{"$f":"K111-VLOOKUP(G111,$AB$26:$AC$43,2,FALSE)","v":9057.39},754.78,null,15375.22]
[null,"A2F2 (B2) 37987",null,"2004-01-01","2005-01-31","B2","A2F2",9485.86,790.49,null,15803.69]
[null,"A2F2 (B2) 38384",null,"2005-02-01","2005-12-30","B2","A2F2",10039.52,836.63,null,16357.35]
[null,"A2F2 (B2) 38717",null,"2005-12-31","2005-12-31","B2","A2F2",10085.120000000001,840.43,null,16402.95]
[null,"A2F2 (B2) 38718",null,"2006-01-01","2006-12-31","B2","A2F2",10176.199999999999,848.02,null,16494.03]
[null,"A2F2 (B2) 39083",null,"2007-01-01","2007-01-31","B2","A2F2",10552.039999999999,879.34,null,16869.87]
[null,"A2F2 (B2) 39114",null,"2007-02-01","2007-12-30","B2","A2F2",11100.56,925.05,null,17418.39]
[null,"A2F2 (B2) 39447",null,"2007-12-31","2007-12-31",{"$f":"F117","v":"B2"},{"$f":"G117","v":"A2F2"},11100.56,925.05,null,17418.39]
[null,"A2F2 (B2) 39448",null,"2008-01-01","2008-12-31","B2","A2F2",11198.000000000002,933.17,null,17515.830000000002]
[null,"A2F2 (B2) 39814",null,"2009-01-01","2010-03-31","B2","A2F2",11879.839999999998,989.99,null,18197.669999999998]
[null,"A2F2 (B2) 40269",null,"2010-04-01","2010-06-30",{"$f":"F120","v":"B2"},"A2F2",11879.839999999998,989.99,null,18197.669999999998]
[null,"A2F2 (B2) 40360",null,"2010-07-01","2015-12-31","B2","A2F2",11879.839999999998,989.99,null,18197.669999999998]
[null,"A2F2 (B2) 42370",null,"2016-01-01","2016-12-31",{"$f":"F122","v":"B2"},{"$f":"G122","v":"A2F2"},11963.839999999998,996.99,null,18281.669999999998]
[null,"A2F2 (B2) 42736",null,"2017-01-01","2018-02-28",{"$f":"F123","v":"B2"},{"$f":"G123","v":"A2F2"},12135.44,1011.29,null,18453.27]
[null,"A2F2 (B2) 43160",null,"2018-03-01","2018-03-31","B2","A2F2",12677.839999999998,1056.49,null,18995.669999999998]
[null,"A2F2 (B2) 43191",null,"2018-04-01","2018-12-31","B2","A2F2",12814.320000000002,1067.8599999999999,null,19132.150000000001]
[null,"A2F2 (B2) 43466",null,"2019-01-01","2019-12-31","B2","A2F2",12984.72,1082.06,null,{"$f":"HLOOKUP(G127,'CCNL 2019-2021'!$M$22:$AB$27,'CCNL 2019-2021'!$K$23,FALSE)","v":19302.55}]
[null,"A2F2 (B2) 43831",null,"2020-01-01","2020-12-31","B2","A2F2",13158.72,1096.56,null,{"$f":"HLOOKUP(G128,'CCNL 2019-2021'!$M$22:$AB$27,'CCNL 2019-2021'!$K$24,FALSE)","v":19476.55}]
[null,"A2F2 (B2) 44197",null,"2021-01-01","2022-06-30","B2","A2F2",13612.320000000002,1134.3599999999999,null,{"$f":"HLOOKUP(G129,'CCNL 2019-2021'!$M$22:$AB$27,'CCNL 2019-2021'!$K$25,FALSE)","v":19930.150000000001}]
[null,"A2F2 (B2) 44743",null,"2022-07-01","2022-10-31","B2","A2F2",13849.200000000003,1154.0999999999999,null,{"$f":"HLOOKUP(G130,'CCNL 2019-2021'!$M$22:$AB$27,'CCNL 2019-2021'!$K$26,FALSE)","v":20167.030000000002}]
[null,"A2F2 (B2) 44866",null,"2022-11-01","9999-01-01","B2","A2F2",{"$f":"VLOOKUP(G131,$AH$28:$AI$43,2,FALSE)","v":13034.04},1086.17]
[null,null,null,"B3","A2F3"]
[null,{"$f":"CONCATENATE(G133,\" (\",F133,\") \",D133)","v":"A2F3 (B3) 35977"},null,"1998-07-01","1998-10-31","B3","A2F3",{"$f":"ROUND(K133/1936.27,2)","v":7977.71},{"$f":"ROUND(H133/12,2)","v":664.81},null,15447000]
[null,"A2F3 (B3) 36100",null,"1998-11-01","1999-05-31","B3","A2F3",{"$f":"ROUND(K134/1936.27,2)","v":8238},686.5,null,15951000]
[null,"A2F3 (B3) 36312",null,"1999-06-01","2000-06-30","B3","A2F3",8454.92,704.58,null,16371000]
[null,"A2F3 (B3) 36708",null,"2000-07-01","2000-12-31","B3","A2F3",8678.0300000000007,723.17,null,16803000]
[null,"A2F3 (B3) 36892",null,"2001-01-01","2001-12-31","B3","A2F3",9049.8700000000008,754.16,null,17523000]
[null,"A2F3 (B3) 37257",null,"2002-01-01","2002-12-31","B3","A2F3",{"$f":"K138","v":9487.8700000000008},790.66,null,9487.8700000000008]
[null,"A2F3 (B3) 37622",null,"2003-01-01","2003-12-31","B3","A2F3",{"$f":"K139-VLOOKUP(G139,$AB$26:$AC$43,2,FALSE)","v":9975.1899999999987},831.27,null,16346.23]
[null,"A2F3 (B3) 37987",null,"2004-01-01","2005-01-31","B3","A2F3",10430.719999999998,869.23,null,16801.759999999998]
[null,"A2F3 (B3) 38384",null,"2005-02-01","2005-12-30","B3","A2F3",11019.349999999999,918.28,null,17390.39]
[null,"A2F3 (B3) 38717",null,"2005-12-31","2005-12-31","B3","A2F3",11067.829999999998,922.32,null,17438.87]
[null,"A2F3 (B3) 38718",null,"2006-01-01","2006-12-31","B3","A2F3",11164.669999999998,930.39,null,17535.71]
[null,"A2F3 (B3) 39083",null,"2007-01-01","2007-01-31","B3","A2F3",11558.149999999998,963.18,null,17929.189999999999]
[null,"A2F3 (B3) 39114",null,"2007-02-01","2007-12-30","B3","A2F3",12159.95,1013.33,null,18530.990000000002]
[null,"A2F3 (B3) 39447",null,"2007-12-31","2007-12-31",{"$f":"F145","v":"B3"},{"$f":"G145","v":"A2F3"},12159.95,1013.33,null,18530.990000000002]
[null,"A2F3 (B3) 39448",null,"2008-01-01","2008-12-31","B3","A2F3",12263.629999999997,1021.97,null,18634.669999999998]
[null,"A2F3 (B3) 39814",null,"2009-01-01","2010-03-31","B3","A2F3",13001.029999999999,1083.42,null,19372.07]
[null,"A2F3 (B3) 40269",null,"2010-04-01","2010-06-30",{"$f":"F148","v":"B3"},"A2F3",13001.029999999999,1083.42,null,19372.07]
[null,"A2F3 (B3) 40360",null,"2010-07-01","2015-12-31","B3","A2F3",13001.029999999999,1083.42,null,19372.07]
[null,"A2F3 (B3) 42370",null,"2016-01-01","2016-12-31",{"$f":"F150","v":"B3"},{"$f":"G150","v":"A2F3"},13091.029999999999,1090.92,null,19462.07]
[null,"A2F3 (B3) 42736",null,"2017-01-01","2018-02-28",{"$f":"F151","v":"B3"},{"$f":"G151","v":"A2F3"},13273.43,1106.1199999999999,null,19644.47]
[null,"A2F3 (B3) 43160",null,"2018-03-01","2018-03-31","B3","A2F3",13842.23,1153.52,null,20213.27]
[null,"A2F3 (B3) 43191",null,"2018-04-01","2018-12-31","B3","A2F3",13987.52,1165.6300000000001,null,20358.560000000001]
[null,"A2F3 (B3) 43466",null,"2019-01-01","2019-12-31","B3","A2F3",14168.719999999998,1180.73,null,{"$f":"HLOOKUP(G155,'CCNL 2019-2021'!$M$22:$AB$27,'CCNL 2019-2021'!$K$23,FALSE)","v":20539.759999999998}]
[null,"A2F3 (B3) 43831",null,"2020-01-01","2020-12-31","B3","A2F3",14354.719999999998,1196.23,null,{"$f":"HLOOKUP(G156,'CCNL 2019-2021'!$M$22:$AB$27,'CCNL 2019-2021'!$K$24,FALSE)","v":20725.759999999998}]
[null,"A2F3 (B3) 44197",null,"2021-01-01","2022-06-30","B3","A2F3",14828.719999999998,1235.73,null,{"$f":"HLOOKUP(G157,'CCNL 2019-2021'!$M$22:$AB$27,'CCNL 2019-2021'!$K$25,FALSE)","v":21199.759999999998}]
[null,"A2F3 (B3) 44743",null,"2022-07-01","2022-10-31","B3","A2F3",15078.319999999996,1256.53,null,{"$f":"HLOOKUP(G158,'CCNL 2019-2021'!$M$22:$AB$27,'CCNL 2019-2021'!$K$26,FALSE)","v":21449.359999999997}]
[null,"A2F3 (B3) 44866",null,"2022-11-01","9999-01-01","B3","A2F3",{"$f":"VLOOKUP(G159,$AH$28:$AI$43,2,FALSE)","v":12980.88},1081.74]
[null,null,null,"B3S","A2F4"]
[null,{"$f":"CONCATENATE(G161,\" (\",F161,\") \",D161)","v":"A2F4 (B3S) 35977"},null,"1998-07-01","1998-10-31","B3S","A2F4",{"$f":"ROUND(K161/1936.27,2)","v":9038},{"$f":"ROUND(H161/12,2)","v":753.17},null,17500000]
[null,"A2F4 (B3S) 36100",null,"1998-11-01","1999-05-31","B3S","A2F4",{"$f":"ROUND(K162/1936.27,2)","v":9298.2900000000009},774.86,null,18004000]
[null,"A2F4 (B3S) 36312",null,"1999-06-01","2000-06-30","B3S","A2F4",9515.2000000000007,792.93,null,18424000,null,null,null,null,null," "]
[null,"A2F4 (B3S) 36708",null,"2000-07-01","2000-12-31","B3S","A2F4",9738.31,811.53,null,18856000]
[null,"A2F4 (B3S) 36892",null,"2001-01-01","2001-12-31","B3S","A2F4",10110.16,842.51,null,19576000]
[null,"A2F4 (B3S) 37257",null,"2002-01-01","2002-12-31","B3S","A2F4",{"$f":"K166","v":10548.16},879.01,null,10548.16]
[null,"A2F4 (B3S) 37622",null,"2003-01-01","2003-12-31","B3S","A2F4",{"$f":"K167-VLOOKUP(G167,$AB$26:$AC$43,2,FALSE)","v":11035.48},919.62,null,17406.52]
[null,"A2F4 (B3S) 37987",null,"2004-01-01","2005-01-31","B3S","A2F4",11491.009999999998,957.58,null,17862.05]
[null,"A2F4 (B3S) 38384",null,"2005-02-01","2005-12-30","B3S","A2F4",12079.64,1006.64,null,18450.68]
[null,"A2F4 (B3S) 38717",null,"2005-12-31","2005-12-31","B3S","A2F4",12128.119999999999,1010.68,null,18499.16]
[null,"A2F4 (B3S) 38718",null,"2006-01-01","2006-12-31","B3S","A2F4",12230.84,1019.24,null,18601.88]
[null,"A2F4 (B3S) 39083",null,"2007-01-01","2007-01-31","B3S","A2F4",12651.079999999998,1054.26,null,19022.12]
[null,"A2F4 (B3S) 39114",null,"2007-02-01","2007-12-30","B3S","A2F4",13267.399999999998,1105.6199999999999,null,19638.439999999999]
[null,"A2F4 (B3S) 39447",null,"2007-12-31","2007-12-31","B3S",{"$f":"G173","v":"A2F4"},13267.399999999998,1105.6199999999999,null,19638.439999999999]
[null,"A2F4 (B3S) 39448",null,"2008-01-01","2008-12-31","B3S","A2F4",13377.2,1114.77,null,19748.240000000002,null,null,null," "]
[null,"A2F4 (B3S) 39814",null,"2009-01-01","2010-03-31","B3S","A2F4",14146.04,1178.8399999999999,null,20517.080000000002,null,null,null," "]
[null,"A2F4 (B3S) 40269",null,"2010-04-01","2010-06-30","B3S",{"$f":"G176","v":"A2F4"},14146.04,1178.8399999999999,null,20517.080000000002]
[null,"A2F4 (B3S) 40360",null,"2010-07-01","2015-12-31","B3S","A2F4",14146.04,1178.8399999999999,null,20517.080000000002]
[null,"A2F4 (B3S) 42370",null,"2016-01-01","2016-12-31","B3S",{"$f":"G178","v":"A2F4"},14240.84,1186.74,null,20611.88]
[null,"A2F4 (B3S) 42736",null,"2017-01-01","2018-02-28","B3S",{"$f":"G179","v":"A2F4"},14434.04,1202.8399999999999,null,20805.080000000002]
[null,"A2F4 (B3S) 43160",null,"2018-03-01","2018-03-31","B3S","A2F4",15070.04,1255.8399999999999,null,21441.08]
[null,"A2F4 (B3S) 43191",null,"2018-04-01","2018-12-31",{"$f":"F181","v":"B3S"},"A2F4",15223.919999999998,1268.6600000000001,null,21594.959999999999]
[null,{"$f":"CONCATENATE(G183,\" (\",F183,\") \",D183)","v":"A2F4 (B3S) 43466"},null,"2019-01-01","2019-12-31","B3S","A2F4",15415.919999999998,1284.6600000000001,null,{"$f":"HLOOKUP(G183,'CCNL 2019-2021'!$M$22:$AB$27,'CCNL 2019-2021'!$K$23,FALSE)","v":21786.959999999999}]
[null,{"$f":"CONCATENATE(G184,\" (\",F184,\") \",D184)","v":"A2F4 (B3S) 43831"},null,"2020-01-01","2020-12-31","B3S","A2F4",15612.719999999998,1301.06,null,{"$f":"HLOOKUP(G184,'CCNL 2019-2021'!$M$22:$AB$27,'CCNL 2019-2021'!$K$24,FALSE)","v":21983.759999999998}]
[null,"A2F4 (B3S) 44197",null,"2021-01-01","2022-06-30","B3S","A2F4",16147.919999999998,1345.66,null,{"$f":"HLOOKUP(G185,'CCNL 2019-2021'!$M$22:$AB$27,'CCNL 2019-2021'!$K$25,FALSE)","v":22518.959999999999}]
[null,"A2F4 (B3S) 44743",null,"2022-07-01","2022-10-31","B3S","A2F4",16422,1368.5,null,{"$f":"HLOOKUP(G186,'CCNL 2019-2021'!$M$22:$AB$27,'CCNL 2019-2021'!$K$26,FALSE)","v":22793.040000000001}]
[null,"A2F4 (B3S) 44866",null,"2022-11-01","9999-01-01","B3S","A2F4",{"$f":"VLOOKUP(G187,$AH$28:$AI$43,2,FALSE)","v":12980.88},1081.74]
[null,null,null,"--------","A2F5"]
[null,{"$f":"CONCATENATE(G189,\" \",D189)","v":"A2F5 36100"},null,"1998-11-01","2007-12-30","--------","A2F5",0,{"$f":"ROUND(H189/12,2)","v":0}]
[null,"A2F5 39447",null,"2007-12-31","2007-12-31","--------","A2F5",{"$f":"K190-VLOOKUP(G190,$AB$26:$AC$43,2,FALSE)","v":13930.07},1160.8399999999999,null,20301.11]
[null,"A2F5 39448",null,"2008-01-01","2008-12-31","--------","A2F5",14043.59,1170.3,null,20414.63]
[null,"A2F5 39814",null,"2009-01-01","2010-03-31","--------","A2F5",14838.349999999999,1236.53,null,21209.39]
[null,"A2F5 40269",null,"2010-04-01","2010-06-30",{"$f":"F192","v":"--------"},"A2F5",14838.349999999999,1236.53,null,21209.39]
[null,"A2F5 40360",null,"2010-07-01","2015-12-31","--------","A2F5",14838.349999999999,1236.53,null,21209.39]
[null,"A2F5 42370",null,"2016-01-01","2016-12-31",{"$f":"F194","v":"--------"},{"$f":"G194","v":"A2F5"},14936.75,1244.73,null,21307.79]
[null,"A2F5 42736",null,"2017-01-01","2018-02-28",{"$f":"F195","v":"--------"},{"$f":"G195","v":"A2F5"},15135.95,1261.33,null,21506.99]
[null,"A2F5 43160",null,"2018-03-01","2018-03-31","--------","A2F5",15847.55,1320.63,null,22218.59]
[null,"A2F5 43191",null,"2018-04-01","2018-12-31","--------","A2F5",16006.619999999999,1333.89,null,22377.66]
[null,"A2F5 43466",null,"2019-01-01","2019-12-31","--------","A2F5",16205.82,1350.49,null,{"$f":"HLOOKUP(G199,'CCNL 2019-2021'!$M$22:$AB$27,'CCNL 2019-2021'!$K$23,FALSE)","v":22576.86}]
[null,"A2F5 43831",null,"2020-01-01","2020-12-31","--------","A2F5",16409.82,1367.49,null,{"$f":"HLOOKUP(G200,'CCNL 2019-2021'!$M$22:$AB$27,'CCNL 2019-2021'!$K$24,FALSE)","v":22780.86}]
[null,"A2F5 44197",null,"2021-01-01","2022-06-30","--------","A2F5",17015.82,1417.99,null,{"$f":"HLOOKUP(G201,'CCNL 2019-2021'!$M$22:$AB$27,'CCNL 2019-2021'!$K$25,FALSE)","v":23386.86}]
[null,"A2F5 44743",null,"2022-07-01","2022-10-31","--------","A2F5",17015.82,1417.99,null,{"$f":"HLOOKUP(G202,'CCNL 2019-2021'!$M$22:$AB$27,'CCNL 2019-2021'!$K$26,FALSE)","v":23386.86}]
[null,"A2F5 44866",null,"2022-11-01","9999-01-01","--------","A2F5",{"$f":"VLOOKUP(G203,$AH$28:$AI$43,2,FALSE)","v":12980.88},1081.74]
[null,null,null,"--------","A2F6"]
[null,{"$f":"CONCATENATE(G205,\" \",D205)","v":"A2F6 36100"},null,"1998-11-01","2007-12-30","--------","A2F6",0,{"$f":"ROUND(H205/12,2)","v":0}]
[null,"A2F6 39447",null,"2007-12-31","2007-12-31","--------","A2F6",{"$f":"K206-VLOOKUP(G206,$AB$26:$AC$43,2,FALSE)","v":14517.259999999998},1209.77,null,20888.3]
[null,"A2F6 39448",null,"2008-01-01","2008-12-31","--------","A2F6",14634.02,1219.5,null,21005.06]
[null,"A2F6 39814",null,"2009-01-01","2010-03-31","--------","A2F6",15451.82,1287.6500000000001,null,21822.86]
[null,"A2F6 40269",null,"2010-04-01","2010-06-30",{"$f":"F208","v":"--------"},"A2F6",15451.82,1287.6500000000001,null,21822.86]
[null,"A2F6 40360",null,"2010-07-01","2015-12-31","--------","A2F6",15451.82,1287.6500000000001,null,21822.86]
[null,"A2F6 42370",null,"2016-01-01","2016-12-31",{"$f":"F210","v":"--------"},{"$f":"G210","v":"A2F6"},15552.619999999999,1296.05,null,21923.66]
[null,"A2F6 42736",null,"2017-01-01","2018-02-28",{"$f":"F211","v":"--------"},{"$f":"G211","v":"A2F6"},15757.82,1313.15,null,22128.86]
[null,"A2F6 43160",null,"2018-03-01","2018-03-31","--------","A2F6",16480.219999999998,1373.35,null,22851.26]
[null,"A2F6 43191",null,"2018-04-01","2018-12-31","--------","A2F6",16643.89,1386.99,null,23014.93]
[null,"A2F6 43466",null,"2019-01-01","2019-12-31","--------","A2F6",16849.09,1404.09,null,{"$f":"HLOOKUP(G215,'CCNL 2019-2021'!$M$22:$AB$27,'CCNL 2019-2021'!$K$23,FALSE)","v":23220.13}]
[null,"A2F6 43831",null,"2020-01-01","2020-12-31","--------","A2F6",17059.09,1421.59,null,{"$f":"HLOOKUP(G216,'CCNL 2019-2021'!$M$22:$AB$27,'CCNL 2019-2021'!$K$24,FALSE)","v":23430.13}]
[null,"A2F6 44197",null,"2021-01-01","2022-06-30","--------","A2F6",17672.29,1472.69,null,{"$f":"HLOOKUP(G217,'CCNL 2019-2021'!$M$22:$AB$27,'CCNL 2019-2021'!$K$25,FALSE)","v":24043.33}]
[null,"A2F6 44743",null,"2022-07-01","2022-10-31","--------","A2F6",17672.29,1472.69,null,{"$f":"HLOOKUP(G218,'CCNL 2019-2021'!$M$22:$AB$27,'CCNL 2019-2021'!$K$26,FALSE)","v":24043.33}]
[null,"A2F6 44866",null,"2022-11-01","9999-01-01","--------","A2F6",{"$f":"VLOOKUP(G219,$AH$28:$AI$43,2,FALSE)","v":12980.88},1081.74]
[null,null,null,"C1","A3F1"]
[null,{"$f":"CONCATENATE(G221,\" (\",F221,\") \",D221)","v":"A3F1 (C1) 35977"},null,"1998-07-01","1998-10-31","C1","A3F1",{"$f":"ROUND(K221/1936.27,2)","v":9233.73},{"$f":"ROUND(H221/12,2)","v":769.48},null,17879000]
[null,"A3F1 (C1) 36100",null,"1998-11-01","1999-05-31","C1","A3F1",{"$f":"ROUND(K222/1936.27,2)","v":9512.6200000000008},792.72,null,18419000]
[null,"A3F1 (C1) 36312",null,"1999-06-01","2000-06-30","C1","A3F1",9748.1200000000008,812.34,null,18875000]
[null,"A3F1 (C1) 36708",null,"2000-07-01","2000-12-31","C1","A3F1",9989.83,832.49,null,19343000]
[null,"A3F1 (C1) 36892",null,"2001-01-01","2001-12-31","C1","A3F1",10398.86,866.57,null,20135000]
[null,"A3F1 (C1) 37257",null,"2002-01-01","2002-12-31","C1","A3F1",{"$f":"K226","v":10876.46},906.37,null,10876.46,null,"Posizione economica",null,"Dal 31.12.2005"]
[null,"A3F1 (C1) 37622",null,"2003-01-01","2003-12-31","C1","A3F1",{"$f":"K227-VLOOKUP(G227,$AB$26:$AC$43,2,FALSE)","v":11409.259999999998},950.77,null,17855.12,null,"Ispettore Generale r.e.",null,28449.75]
[null,"A3F1 (C1) 37987",null,"2004-01-01","2005-01-31","C1","A3F1",11906.84,992.24,null,18352.7,null,"Direttore Divisione r.e",null,26440.880000000001]
[null,"A3F1 (C1) 38384",null,"2005-02-01","2005-12-30","C1","A3F1",12549.8,1045.82,null,18995.66,null,"C3 –S",null,"24,385,26"]
[null,"A3F1 (C1) 38717",null,"2005-12-31","2005-12-31","C1","A3F1",12602.759999999998,1050.23,null,19048.62,null,"C3",null,22907.68]
[null,"A3F1 (C1) 38718",null,"2006-01-01","2006-12-31","C1","A3F1",12708.48,1059.04,null,19154.34,null,"C2",null,20852.7]
[null,"A3F1 (C1) 39083",null,"2007-01-01","2007-01-31","C1","A3F1",13141.32,1095.1099999999999,null,19587.18,null,"C1-S",null,19730.86]
[null,"A3F1 (C1) 39114",null,"2007-02-01","2007-12-30","C1","A3F1",13774.8,1147.9000000000001,null,20220.66,null,"C1",null,19048.62]
[null,"A3F1 (C1) 39447",null,"2007-12-31","2007-12-31",{"$f":"F233","v":"C1"},{"$f":"G233","v":"A3F1"},13774.8,1147.9000000000001,null,20220.66,null,"B3-S",null,18499.16]
[null,"A3F1 (C1) 39448",null,"2008-01-01","2008-12-31","C1","A3F1",13887.84,1157.32,null,20333.7,null,"B3",null,17438.87]
[null,"A3F1 (C1) 39814",null,"2009-01-01","2010-03-31","C1","A3F1",14679.48,1223.29,null,21125.34,null,"B2",null,16402.95]
[null,"A3F1 (C1) 40269",null,"2010-04-01","2010-06-30",{"$f":"F236","v":"C1"},"A3F1",14679.48,1223.29,null,21125.34,null,"B1",null,15596.59]
[null,"A3F1 (C1) 40360",null,"2010-07-01","2015-12-31","C1","A3F1",14679.48,1223.29,null,21125.34,null,"A1-S",null,"15.299.05"]
[null,"A3F1 (C1) 42370",null,"2016-01-01","2016-12-31",{"$f":"F238","v":"C1"},{"$f":"G238","v":"A3F1"},14777.880000000001,1231.49,null,21223.74,null,"A1",null,14768.65]
[null,"A3F1 (C1) 42736",null,"2017-01-01","2018-02-28",{"$f":"F239","v":"C1"},{"$f":"G239","v":"A3F1"},14975.880000000001,1247.99,null,21421.74]
[null,"A3F1 (C1) 43160",null,"2018-03-01","2018-03-31","C1","A3F1",15687.48,1307.29,null,22133.34]
[null,"A3F1 (C1) 43191",null,"2018-04-01","2018-12-31","C1","A3F1",15845.919999999998,1320.49,null,22291.78]
[null,{"$f":"CONCATENATE(G243,\" (\",F243,\") \",D243)","v":"A3F1 (C1) 43466"},null,"2019-01-01","2019-12-31","C1","A3F1",16043.919999999998,1336.99,null,{"$f":"HLOOKUP(G243,'CCNL 2019-2021'!$M$22:$AB$27,'CCNL 2019-2021'!$K$23,FALSE)","v":22489.78}]
[null,{"$f":"CONCATENATE(G244,\" (\",F244,\") \",D244)","v":"A3F1 (C1) 43831"},null,"2020-01-01","2020-12-31","C1","A3F1",16247.919999999998,1353.99,null,{"$f":"HLOOKUP(G244,'CCNL 2019-2021'!$M$22:$AB$27,'CCNL 2019-2021'!$K$24,FALSE)","v":22693.78}]
[null,"A3F1 (C1) 44197",null,"2021-01-01","2022-06-30","C1","A3F1",16853.919999999998,1404.49,null,{"$f":"HLOOKUP(G245,'CCNL 2019-2021'!$M$22:$AB$27,'CCNL 2019-2021'!$K$25,FALSE)","v":23299.78}]
[null,"A3F1 (C1) 44743",null,"2022-07-01","2022-10-31","C1","A3F1",16853.919999999998,1404.49,null,{"$f":"HLOOKUP(G246,'CCNL 2019-2021'!$M$22:$AB$27,'CCNL 2019-2021'!$K$26,FALSE)","v":23299.78}]
[null,"A3F1 (C1) 44866",null,"2022-11-01","9999-01-01","C1","A3F1",{"$f":"VLOOKUP(G247,$AH$28:$AI$43,2,FALSE)","v":17056.080000000002},1421.34,null,null,null,null,null,null,"01.02.2007"]
[null,null,null,"C1S","A3F2",null,null,null,null,null,null,null,"Dal","1.1.2006","1.1.2007","31.12.2007",null,"Dal","31.12.2007"]
[null,{"$f":"CONCATENATE(G249,\" (\",F249,\") \",D249)","v":"A3F2 (C1S) 35977"},null,"1998-07-01","1998-10-31","C1S","A3F2",{"$f":"ROUND(K249/1936.27,2)","v":9915.9699999999993},{"$f":"ROUND(H249/12,2)","v":826.33},null,19200000,null,"C3S",24520.62,25073.34,25882.86,null,"A3F7",29336.18]
[null,"A3F2 (C1S) 36100",null,"1998-11-01","1999-05-31","C1S","A3F2",{"$f":"ROUND(K250/1936.27,2)","v":10194.86},849.57,null,19740000,null,"C3",23034.87,23553.63,24315.03,null,"A3F6",27643.68]
[null,"A3F2 (C1S) 36312",null,"1999-06-01","2000-06-30","C1S","A3F2",10430.36,869.2,null,20196000,null,"C2",20968.38,21441.42,22134.06,null,"A2F6",20888.3]
[null,"A3F2 (C1S) 36708",null,"2000-07-01","2000-12-31","C1S","A3F2",10672.07,889.34,null,20664000,null,"C1S",19840.419999999998,20287.66,20943.939999999999,null,"A2F5",20301.11]
[null,"A3F2 (C1S) 36892",null,"2001-01-01","2001-12-31","C1S","A3F2",11081.1,923.43,null,21456000,null,"C1",19154.34,19587.18,20220.66,null,"A1F3",16846.21]
[null,"A3F2 (C1S) 37257",null,"2002-01-01","2002-12-31","C1S","A3F2",{"$f":"K254","v":11558.7},963.23,null,11558.7,null,"B3S",18601.88,19022.12,19638.439999999999]
[null,"A3F2 (C1S) 37622",null,"2003-01-01","2003-12-31","C1S","A3F2",{"$f":"K255-VLOOKUP(G255,$AB$26:$AC$43,2,FALSE)","v":12091.5},1007.63,null,18537.36,null,"B3",17535.71,17929.189999999999,18530.990000000002]
[null,"A3F2 (C1S) 37987",null,"2004-01-01","2005-01-31","C1S","A3F2",12589.079999999998,1049.0899999999999,null,19034.939999999999,null,"B2",16494.03,16869.87,17418.39]
[null,"A3F2 (C1S) 38384",null,"2005-02-01","2005-12-30","C1S","A3F2",13232.04,1102.67,null,19677.900000000001,null,"B1",15683.11,16040.47,16562.11]
[null,"A3F2 (C1S) 38717",null,"2005-12-31","2005-12-31","C1S","A3F2",13285,1107.08,null,19730.86,null,"A1S",15384.01,15734.53,16246.21]
[null,"A3F2 (C1S) 38718",null,"2006-01-01","2006-12-31","C1S","A3F2",13394.559999999998,1116.21,null,19840.419999999998,null,"A1",14850.61,15189.01,15682.93]
[null,"A3F2 (C1S) 39083",null,"2007-01-01","2007-01-31","C1S","A3F2",13841.8,1153.48,null,20287.66]
[null,"A3F2 (C1S) 39114",null,"2007-02-01","2007-12-30","C1S","A3F2",14498.079999999998,1208.17,null,20943.939999999999]
[null,"A3F2 (C1S) 39447",null,"2007-12-31","2007-12-31","C1S",{"$f":"G261","v":"A3F2"},14498.079999999998,1208.17,null,20943.939999999999,null,"TABELLA B"]
[null,"A3F2 (C1S) 39448",null,"2008-01-01","2008-12-31","C1S","A3F2",14615.2,1217.93,null,21061.06,null,"Nuona retribuzione tabellare annua"]
[null,"A3F2 (C1S) 39814",null,"2009-01-01","2010-03-31","C1S","A3F2",15435.04,1286.25,null,21880.9,null,"Valori in Euro per 12 mensilità cui aggiungere la 13^"]
[null,"A3F2 (C1S) 40269",null,"2010-04-01","2010-06-30","C1S",{"$f":"G264","v":"A3F2"},15435.04,1286.25,null,21880.9]
[null,"A3F2 (C1S) 40360",null,"2010-07-01","2015-12-31","C1S","A3F2",15435.04,1286.25,null,21880.9,null,"Posizione economica","Dal 1.1.2008",null,"Dal 1.1.2009"]
[null,"A3F2 (C1S) 42370",null,"2016-01-01","2016-12-31","C1S",{"$f":"G266","v":"A3F2"},15537.04,1294.75,null,21982.9,null,"Ispettore generale r.e",30379.95,null,31562.55]
[null,"A3F2 (C1S) 42736",null,"2017-01-01","2018-02-28","C1S",{"$f":"G267","v":"A3F2"},15742.239999999998,1311.85,null,22188.1,null,"Direttore divisione r.e",28234.76,null,29333.96]
[null,"A3F2 (C1S) 43160",null,"2018-03-01","2018-03-31","C1S","A3F2",16464.64,1372.05,null,22910.5,null,"III F 7",29500.22,null,30648.62]
[null,"A3F2 (C1S) 43191",null,"2018-04-01","2018-12-31",{"$f":"F269","v":"C1S"},"A3F2",16628.75,1385.73,null,23074.61,null,"III F 6",27798.240000000002,null,28880.400000000001]
[null,{"$f":"CONCATENATE(G271,\" (\",F271,\") \",D271)","v":"A3F2 (C1S) 43466"},null,"2019-01-01","2019-12-31","C1S","A3F2",16833.95,1402.83,null,{"$f":"HLOOKUP(G271,'CCNL 2019-2021'!$M$22:$AB$27,'CCNL 2019-2021'!$K$23,FALSE)","v":23279.81},null,"III F 5",26027.58,null,27040.86]
[null,{"$f":"CONCATENATE(G272,\" (\",F272,\") \",D272)","v":"A3F2 (C1S) 43831"},null,"2020-01-01","2020-12-31","C1S","A3F2",17043.95,1420.33,null,{"$f":"HLOOKUP(G272,'CCNL 2019-2021'!$M$22:$AB$27,'CCNL 2019-2021'!$K$24,FALSE)","v":23489.81},null,"III F 4",24450.99,null,25388.43]
[null,"A3F2 (C1S) 44197",null,"2021-01-01","2022-06-30","C1S","A3F2",17658.349999999999,1471.53,null,{"$f":"HLOOKUP(G273,'CCNL 2019-2021'!$M$22:$AB$27,'CCNL 2019-2021'!$K$25,FALSE)","v":24104.21},null,"III F 3",22257.78,null,23112.3]
[null,"A3F2 (C1S) 44743",null,"2022-07-01","2022-10-31","C1S","A3F2",17658.349999999999,1471.53,null,{"$f":"HLOOKUP(G274,'CCNL 2019-2021'!$M$22:$AB$27,'CCNL 2019-2021'!$K$26,FALSE)","v":24104.21},null,"III F 2",21061.06,null,21880.9]
[null,"A3F2 (C1S) 44866",null,"2022-11-01","9999-01-01","C1S","A3F2",{"$f":"VLOOKUP(G275,$AH$28:$AI$43,2,FALSE)","v":17056.080000000002},1421.34,null,null,null,"III F 1",20333.7,null,21125.34]
[null,null,null,"C2","A3F3",null,null,null,null,null,null,null,"II F 6",21005.06,null,21822.86]
[null,{"$f":"CONCATENATE(G277,\" (\",F277,\") \",D277)","v":"A3F3 (C2) 35977"},null,"1998-07-01","1998-10-31","C2","A3F3",{"$f":"ROUND(K277/1936.27,2)","v":10624.03},{"$f":"ROUND(H277/12,2)","v":885.34},null,20571000,null,"II F 5",20414.63,null,21209.39]
[null,"A3F3 (C2) 36100",null,"1998-11-01","1999-05-31","C2","A3F3",{"$f":"ROUND(K278/1936.27,2)","v":10927.71},910.64,null,21159000,null,"II F 4",19748.240000000002,null,20517.080000000002]
[null,"A3F3 (C2) 36312",null,"1999-06-01","2000-06-30","C2","A3F3",11181.81,931.82,null,21651000,null,"II F 3",18634.669999999998,null,19372.07]
[null,"A3F3 (C2) 36708",null,"2000-07-01","2000-12-31","C2","A3F3",11448.3,954.03,null,22167000,null,"II F 2",17515.830000000002,null,18197.669999999998]
[null,"A3F3 (C2) 36892",null,"2001-01-01","2001-12-31","C2","A3F3",11894.52,991.21,null,23031000,null,"II F 1",16654.75,null,17303.11]
[null,"A3F3 (C2) 37257",null,"2002-01-01","2002-12-31","C2","A3F3",{"$f":"K282","v":12417.72},1034.81,null,12417.72,null,"I F 3",16938.849999999999,null,17599.93]
[null,"A3F3 (C2) 37622",null,"2003-01-01","2003-12-31","C2","A3F3",{"$f":"K283-VLOOKUP(G283,$AB$26:$AC$43,2,FALSE)","v":13000.93},1083.4100000000001,null,19546.16,null,"I F 2",16337.05,null,16973.05]
[null,"A3F3 (C2) 37987",null,"2004-01-01","2005-01-31","C2","A3F3",13545.64,1128.8,null,20090.87,null,"I F 1",15770.65,null,16384.57]
[null,"A3F3 (C2) 38384",null,"2005-02-01","2005-12-30","C2","A3F3",14249.490000000002,1187.46,null,20794.72]
[null,"A3F3 (C2) 38717",null,"2005-12-31","2005-12-31","C2","A3F3",14307.470000000001,1192.29,null,20852.7]
[null,"A3F3 (C2) 38718",null,"2006-01-01","2006-12-31","C2","A3F3",14423.150000000001,1201.93,null,20968.38]
[null,"A3F3 (C2) 39083",null,"2007-01-01","2007-01-31","C2","A3F3",14896.189999999999,1241.3499999999999,null,21441.42]
[null,"A3F3 (C2) 39114",null,"2007-02-01","2007-12-30","C2","A3F3",15588.830000000002,1299.07,null,22134.06]
[null,"A3F3 (C2) 39447",null,"2007-12-31","2007-12-31",{"$f":"F289","v":"C2"},{"$f":"G289","v":"A3F3"},15588.830000000002,1299.07,null,22134.06]
[null,"A3F3 (C2) 39448",null,"2008-01-01","2008-12-31","C2","A3F3",15712.55,1309.3800000000001,null,22257.78,null,"CCNL 2016 - 2018"]
[null,"A3F3 (C2) 39814",null,"2009-01-01","2010-03-31","C2","A3F3",16567.07,1380.59,null,23112.3,null,"DAL","2016-01-01","2017-01-01","2018-03-01","2018-04-01"]
[null,"A3F3 (C2) 40269",null,"2010-04-01","2010-06-30",{"$f":"F292","v":"C2"},"A3F3",16567.07,1380.59,null,23112.3,null,"A3F7",30790.22,31079.42,32016.62,32246.48]
[null,"A3F3 (C2) 40360",null,"2010-07-01","2015-12-31","C2","A3F3",16567.07,1380.59,null,23112.3,null,"A3F6",29014.799999999999,29286,30152.400000000001,30369]
[null,"A3F3 (C2) 42370",null,"2016-01-01","2016-12-31",{"$f":"F294","v":"C2"},{"$f":"G294","v":"A3F3"},16673.87,1389.49,null,23219.1,null,"A3F5",27165.66,27420.06,28246.86,28449.67]
[null,"A3F3 (C2) 42736",null,"2017-01-01","2018-02-28",{"$f":"F295","v":"C2"},{"$f":"G295","v":"A3F3"},16891.07,1407.59,null,23436.3,null,"A3F4",25506.03,25744.83,26528.43,26718.84]
[null,"A3F3 (C2) 43160",null,"2018-03-01","2018-03-31","C2","A3F3",17611.07,1467.59,null,24156.3,null,"A3F3",23219.1,23436.3,24156.3,24329.64]
[null,"A3F3 (C2) 43191",null,"2018-04-01","2018-12-31","C2","A3F3",17784.41,1482.03,null,24329.64,null,"A3F2",21982.9,22188.1,22910.5,23074.61]
[null,{"$f":"CONCATENATE(G299,\" (\",F299,\") \",D299)","v":"A3F3 (C2) 43466"},null,"2019-01-01","2019-12-31","C2","A3F3",18000.41,1500.03,null,{"$f":"HLOOKUP(G299,'CCNL 2019-2021'!$M$22:$AB$27,'CCNL 2019-2021'!$K$23,FALSE)","v":24545.64},null,"A3F1",21223.74,21421.74,22133.34,22291.78]
[null,{"$f":"CONCATENATE(G300,\" (\",F300,\") \",D300)","v":"A3F3 (C2) 43831"},null,"2020-01-01","2020-12-31","C2","A3F3",18222.41,1518.53,null,{"$f":"HLOOKUP(G300,'CCNL 2019-2021'!$M$22:$AB$27,'CCNL 2019-2021'!$K$24,FALSE)","v":24767.64},null,"A2F6",21923.66,22128.86,22851.26,23014.93]
[null,"A3F3 (C2) 44197",null,"2021-01-01","2022-06-30","C2","A3F3",18828.41,1569.03,null,{"$f":"HLOOKUP(G301,'CCNL 2019-2021'!$M$22:$AB$27,'CCNL 2019-2021'!$K$25,FALSE)","v":25373.64},null,"A2F5",21307.79,21506.99,22218.59,22377.66]
[null,"A3F3 (C2) 44743",null,"2022-07-01","2022-10-31","C2","A3F3",18828.41,1569.03,null,{"$f":"HLOOKUP(G302,'CCNL 2019-2021'!$M$22:$AB$27,'CCNL 2019-2021'!$K$26,FALSE)","v":25373.64},null,"A2F4",20611.88,20805.080000000002,21441.08,21594.959999999999]
[null,"A3F3 (C2) 44866",null,"2022-11-01","9999-01-01","C2","A3F3",{"$f":"VLOOKUP(G303,$AH$28:$AI$43,2,FALSE)","v":16956.599999999999},1413.05,null,null,null,"A2F3",19462.07,19644.47,20213.27,20358.560000000001]
[null,null,null,"C3","A3F4",null,null,null,null,null,null,null,"A2F2",18281.669999999998,18453.27,18995.669999999998,19132.150000000001]
[null,{"$f":"CONCATENATE(G305,\" (\",F305,\") \",D305)","v":"A3F4 (C3) 35977"},null,"1998-07-01","1998-10-31","C3","A3F4",{"$f":"ROUND(K305/1936.27,2)","v":12208.52},{"$f":"ROUND(H305/12,2)","v":1017.38},null,23639000,null,"A2F1",17383.509999999998,17545.509999999998,18073.509999999998,18203.28]
[null,"A3F4 (C3) 36100",null,"1998-11-01","1999-05-31","C3","A3F4",{"$f":"ROUND(K306/1936.27,2)","v":12549.39},1045.78,null,24299000,null,"A1F3",17681.53,17847.13,18391.93,18523.93]
[null,"A3F4 (C3) 36312",null,"1999-06-01","2000-06-30","C3","A3F4",12834.47,1069.54,null,24851000,null,"A1F2",17052.25,17211.849999999999,17741.05,17868.349999999999]
[null,"A3F4 (C3) 36708",null,"2000-07-01","2000-12-31","C3","A3F4",13125.75,1093.81,null,25415000,null,"A1F1",16460.169999999998,16614.97,17140.57,17263.45]
[null,"A3F4 (C3) 36892",null,"2001-01-01","2001-12-31","C3","A3F4",13615.35,1134.6099999999999,null,26363000]
[null,"A3F4 (C3) 37257",null,"2002-01-01","2002-12-31","C3","A3F4",{"$f":"K310","v":14190.15},1182.51,null,14190.15]
[null,"A3F4 (C3) 37622",null,"2003-01-01","2003-12-31","C3","A3F4",{"$f":"K311-VLOOKUP(G311,$AB$26:$AC$43,2,FALSE)","v":14830.95},1235.9100000000001,null,21472.38]
[null,"A3F4 (C3) 37987",null,"2004-01-01","2005-01-31","C3","A3F4",15429.34,1285.78,null,22070.77]
[null,"A3F4 (C3) 38384",null,"2005-02-01","2005-12-30","C3","A3F4",16202.55,1350.21,null,22843.98]
[null,"A3F4 (C3) 38717",null,"2005-12-31","2005-12-31","C3","A3F4",16266.25,1355.52,null,22907.68]
[null,"A3F4 (C3) 38718",null,"2006-01-01","2006-12-31","C3","A3F4",16393.439999999999,1366.12,null,23034.87,null,"CCNL 2019 - 2021"]
[null,"A3F4 (C3) 39083",null,"2007-01-01","2007-01-31","C3","A3F4",16912.2,1409.35,null,23553.63,null,"DAL","2019-01-01","2020-01-01","2021-01-01","2022-07-01","2022-10-01"]
[null,"A3F4 (C3) 39114",null,"2007-02-01","2007-12-30","C3","A3F4",17673.599999999999,1472.8,null,24315.03,null,"A3F7",32533.279999999999,32827.279999999999,33614.480000000003,33614.480000000003,33631.33]
[null,"A3F4 (C3) 39447",null,"2007-12-31","2007-12-31",{"$f":"F317","v":"C3"},{"$f":"G317","v":"A3F4"},17673.599999999999,1472.8,null,24315.03,null,"A3F6",30639,30916.2,31641,31641,31657.85]
[null,"A3F4 (C3) 39448",null,"2008-01-01","2008-12-31","C3","A3F4",17809.560000000001,1484.13,null,24450.99,null,"A3F5",28702.87,28962.07,29655.67,29655.67,29672.519999999997]
[null,"A3F4 (C3) 39814",null,"2009-01-01","2010-03-31","C3","A3F4",18747,1562.25,null,25388.43,null,"A3F4",26956.44,27200.04,27858.84,27858.84,27875.69]
[null,"A3F4 (C3) 40269",null,"2010-04-01","2010-06-30",{"$f":"F320","v":"C3"},"A3F4",18747,1562.25,null,25388.43,null,"A3F3",24545.64,24767.64,25373.64,25373.64,25390.489999999998]
[null,"A3F4 (C3) 40360",null,"2010-07-01","2015-12-31","C3","A3F4",18747,1562.25,null,25388.43,null,"A3F2",23279.81,23489.81,24104.21,24104.21,24121.059999999998]
[null,"A3F4 (C3) 42370",null,"2016-01-01","2016-12-31",{"$f":"F322","v":"C3"},{"$f":"G322","v":"A3F4"},18864.599999999999,1572.05,null,25506.03,null,"A3F1",22489.78,22693.78,23299.78,23299.78,23316.629999999997]
[null,"A3F4 (C3) 42736",null,"2017-01-01","2018-02-28",{"$f":"F323","v":"C3"},{"$f":"G323","v":"A3F4"},19103.400000000001,1591.95,null,25744.83,null,"A2F6",23220.13,23430.13,24043.33,24043.33,24055.83]
[null,"A3F4 (C3) 43160",null,"2018-03-01","2018-03-31","C3","A3F4",19887,1657.25,null,26528.43,null,"A2F5",22576.86,22780.86,23386.86,23386.86,23399.360000000001]
[null,"A3F4 (C3) 43191",null,"2018-04-01","2018-12-31","C3","A3F4",20077.41,1673.12,null,26718.84,null,"A2F4",21786.959999999999,21983.759999999998,22518.959999999999,22793.040000000001,22805.54]
[null,{"$f":"CONCATENATE(G327,\" (\",F327,\") \",D327)","v":"A3F4 (C3) 43466"},null,"2019-01-01","2019-12-31","C3","A3F4",20315.009999999998,1692.92,null,{"$f":"HLOOKUP(G327,'CCNL 2019-2021'!$M$22:$AB$27,'CCNL 2019-2021'!$K$23,FALSE)","v":26956.44},null,"A2F3",20539.759999999998,20725.759999999998,21199.759999999998,21449.359999999997,21461.859999999997]
[null,{"$f":"CONCATENATE(G328,\" (\",F328,\") \",D328)","v":"A3F4 (C3) 43831"},null,"2020-01-01","2020-12-31","C3","A3F4",20558.61,1713.22,null,{"$f":"HLOOKUP(G328,'CCNL 2019-2021'!$M$22:$AB$27,'CCNL 2019-2021'!$K$24,FALSE)","v":27200.04},null,"A2F2",19302.55,19476.55,19930.150000000001,20167.030000000002,20179.530000000002]
[null,"A3F4 (C3) 44197",null,"2021-01-01","2022-06-30","C3","A3F4",21217.41,1768.12,null,{"$f":"HLOOKUP(G329,'CCNL 2019-2021'!$M$22:$AB$27,'CCNL 2019-2021'!$K$25,FALSE)","v":27858.84},null,"A2F1",18365.28,18530.88,18973.68,19202.04,19214.54]
[null,"A3F4 (C3) 44743",null,"2022-07-01","2022-10-31","C3","A3F4",21217.41,1768.12,null,{"$f":"HLOOKUP(G330,'CCNL 2019-2021'!$M$22:$AB$27,'CCNL 2019-2021'!$K$26,FALSE)","v":27858.84},null,"A1F3",18688.330000000002,18857.53,19315.93,19550.650000000001,19562.920000000002]
[null,"A3F4 (C3) 44866",null,"2022-11-01","9999-01-01","C3","A3F4",{"$f":"VLOOKUP(G331,$AH$28:$AI$43,2,FALSE)","v":16860.48},1405.04,null,null,null,"A1F2",18026.75,18189.95,18636.349999999999,18864.71,18876.98]
[null,null,null,"C3S","A3F5",null,null,null,null,null,null,null,"A1F1",17417.05,17574.25,18019.45,18243.61,18255.88]
[null,{"$f":"CONCATENATE(G333,\" (\",F333,\") \",D333)","v":"A3F5 (C3S) 35977"},null,"1998-07-01","1998-10-31","C3S","A3F5",{"$f":"ROUND(K333/1936.27,2)","v":13686.11},{"$f":"ROUND(H333/12,2)","v":1140.51},null,26500000]
[null,"A3F5 (C3S) 36100",null,"1998-11-01","1999-05-31","C3S","A3F5",{"$f":"ROUND(K334/1936.27,2)","v":14026.97},1168.9100000000001,null,27160000]
[null,"A3F5 (C3S) 36312",null,"1999-06-01","2000-06-30","C3S","A3F5",14312.05,1192.67,null,27712000]
[null,"A3F5 (C3S) 36708",null,"2000-07-01","2000-12-31","C3S","A3F5",14603.34,1216.95,null,28276000]
[null,"A3F5 (C3S) 36892",null,"2001-01-01","2001-12-31","C3S","A3F5",15092.94,1257.75,null,29224000]
[null,"A3F5 (C3S) 37257",null,"2002-01-01","2002-12-31","C3S","A3F5",{"$f":"K338","v":15667.74},1305.6500000000001,null,15667.74]
[null,"A3F5 (C3S) 37622",null,"2003-01-01","2003-12-31","C3S","A3F5",{"$f":"K339-VLOOKUP(G339,$AB$26:$AC$43,2,FALSE)","v":16308.54},1359.05,null,22949.97]
[null,"A3F5 (C3S) 37987",null,"2004-01-01","2005-01-31","C3S","A3F5",16906.93,1408.91,null,23548.36]
[null,"A3F5 (C3S) 38384",null,"2005-02-01","2005-12-30","C3S","A3F5",17680.14,1473.35,null,24321.57]
[null,"A3F5 (C3S) 38717",null,"2005-12-31","2005-12-31","C3S","A3F5",17743.829999999998,1478.65,null,24385.26]
[null,"A3F5 (C3S) 38718",null,"2006-01-01","2006-12-31","C3S","A3F5",17879.189999999999,1489.93,null,24520.62]
[null,"A3F5 (C3S) 39083",null,"2007-01-01","2007-01-31","C3S","A3F5",18431.91,1535.99,null,25073.34]
[null,"A3F5 (C3S) 39114",null,"2007-02-01","2007-12-30","C3S","A3F5",19241.43,1603.45,null,25882.86]
[null,"A3F5 (C3S) 39447",null,"2007-12-31","2007-12-31","C3S",{"$f":"G345","v":"A3F5"},19241.43,1603.45,null,25882.86]
[null,"A3F5 (C3S) 39448",null,"2008-01-01","2008-12-31","C3S","A3F5",19386.150000000001,1615.51,null,26027.58]
[null,"A3F5 (C3S) 39814",null,"2009-01-01","2010-03-31","C3S","A3F5",20399.43,1699.95,null,27040.86]
[null,"A3F5 (C3S) 40269",null,"2010-04-01","2010-06-30","C3S",{"$f":"G348","v":"A3F5"},20399.43,1699.95,null,27040.86]
[null,"A3F5 (C3S) 40360",null,"2010-07-01","2015-12-31","C3S","A3F5",20399.43,1699.95,null,27040.86]
[null,"A3F5 (C3S) 42370",null,"2016-01-01","2016-12-31","C3S",{"$f":"G350","v":"A3F5"},20524.23,1710.35,null,27165.66]
[null,"A3F5 (C3S) 42736",null,"2017-01-01","2018-02-28","C3S",{"$f":"G351","v":"A3F5"},20778.63,1731.55,null,27420.06]
[null,"A3F5 (C3S) 43160",null,"2018-03-01","2018-03-31","C3S","A3F5",21605.43,1800.45,null,28246.86]
[null,"A3F5 (C3S) 43191",null,"2018-04-01","2018-12-31",{"$f":"F353","v":"C3S"},"A3F5",21808.239999999998,1817.35,null,28449.67]
[null,{"$f":"CONCATENATE(G355,\" (\",F355,\") \",D355)","v":"A3F5 (C3S) 43466"},null,"2019-01-01","2019-12-31","C3S","A3F5",22061.439999999999,1838.45,null,{"$f":"HLOOKUP(G355,'CCNL 2019-2021'!$M$22:$AB$27,'CCNL 2019-2021'!$K$23,FALSE)","v":28702.87}]
[null,{"$f":"CONCATENATE(G356,\" (\",F356,\") \",D356)","v":"A3F5 (C3S) 43831"},null,"2020-01-01","2020-12-31","C3S","A3F5",22320.639999999999,1860.05,null,{"$f":"HLOOKUP(G356,'CCNL 2019-2021'!$M$22:$AB$27,'CCNL 2019-2021'!$K$24,FALSE)","v":28962.07}]
[null,"A3F5 (C3S) 44197",null,"2021-01-01","2022-06-30","C3S","A3F5",23014.239999999998,1917.85,null,{"$f":"HLOOKUP(G357,'CCNL 2019-2021'!$M$22:$AB$27,'CCNL 2019-2021'!$K$25,FALSE)","v":29655.67}]
[null,"A3F5 (C3S) 44743",null,"2022-07-01","2022-10-31","C3S","A3F5",23014.239999999998,1917.85,null,{"$f":"HLOOKUP(G358,'CCNL 2019-2021'!$M$22:$AB$27,'CCNL 2019-2021'!$K$26,FALSE)","v":29655.67}]
[null,"A3F5 (C3S) 44866",null,"2022-11-01","9999-01-01","C3S","A3F5",{"$f":"VLOOKUP(G359,$AH$28:$AI$43,2,FALSE)","v":16860.48},1405.04]
[null,null,null,"--------","A3F6"]
[null,{"$f":"CONCATENATE(G361,\" \",D361)","v":"A3F6 36100"},null,"1998-11-01","2007-12-30","--------","A3F6",0,{"$f":"ROUND(H361/12,2)","v":0}]
[null,"A3F6 39447",null,"2007-12-31","2007-12-31","--------","A3F6",{"$f":"K362-VLOOKUP(G362,$AB$26:$AC$43,2,FALSE)","v":21002.25},1750.19,null,27643.68]
[null,"A3F6 39448",null,"2008-01-01","2008-12-31","--------","A3F6",21156.81,1763.07,null,27798.240000000002]
[null,"A3F6 39814",null,"2009-01-01","2010-03-31","--------","A3F6",22238.97,1853.25,null,28880.400000000001]
[null,"A3F6 40269",null,"2010-04-01","2010-06-30",{"$f":"F364","v":"--------"},"A3F6",22238.97,1853.25,null,28880.400000000001]
[null,"A3F6 40360",null,"2010-07-01","2015-12-31","--------","A3F6",22238.97,1853.25,null,28880.400000000001]
[null,"A3F6 42370",null,"2016-01-01","2016-12-31",{"$f":"F366","v":"--------"},{"$f":"G366","v":"A3F6"},22373.37,1864.45,null,29014.799999999999]
[null,"A3F6 42736",null,"2017-01-01","2018-02-28",{"$f":"F367","v":"--------"},{"$f":"G367","v":"A3F6"},22644.57,1887.05,null,29286]
[null,"A3F6 43160",null,"2018-03-01","2018-03-31","--------","A3F6",23510.97,1959.25,null,30152.400000000001]
[null,{"$f":"CONCATENATE(G370,\" \",D370)","v":"A3F6 43191"},null,"2018-04-01","2018-12-31","--------","A3F6",23727.57,1977.3,null,30369,null,null,null," "]
[null,"A3F6 43466",null,"2019-01-01","2019-12-31","--------","A3F6",23997.57,1999.8,null,{"$f":"HLOOKUP(G371,'CCNL 2019-2021'!$M$22:$AB$27,'CCNL 2019-2021'!$K$23,FALSE)","v":30639}]
[null,"A3F6 43831",null,"2020-01-01","2020-12-31","--------","A3F6",24274.77,2022.9,null,{"$f":"HLOOKUP(G372,'CCNL 2019-2021'!$M$22:$AB$27,'CCNL 2019-2021'!$K$24,FALSE)","v":30916.2}]
[null,"A3F6 44197",null,"2021-01-01","2022-06-30","--------","A3F6",24999.57,2083.3000000000002,null,{"$f":"HLOOKUP(G373,'CCNL 2019-2021'!$M$22:$AB$27,'CCNL 2019-2021'!$K$25,FALSE)","v":31641}]
[null,"A3F6 44743",null,"2022-07-01","2022-10-31","--------","A3F6",24999.57,2083.3000000000002,null,{"$f":"HLOOKUP(G374,'CCNL 2019-2021'!$M$22:$AB$27,'CCNL 2019-2021'!$K$26,FALSE)","v":31641}]
[null,"A3F6 44866",null,"2022-11-01","9999-01-01","--------","A3F6",{"$f":"VLOOKUP(G375,$AH$28:$AI$43,2,FALSE)","v":16860.48},1405.04]
[null,null,null,"--------","A3F7"]
[null,"A3F7 36100",null,"1998-11-01","2007-12-30","--------","A3F7",0,{"$f":"ROUND(H377/12,2)","v":0}]
[null,"A3F7 39447",null,"2007-12-31","2007-12-31","--------","A3F7",{"$f":"K378-VLOOKUP(G378,$AB$26:$AC$43,2,FALSE)","v":22694.75},1891.23,null,29336.18]
[null,"A3F7 39448",null,"2008-01-01","2008-12-31","--------","A3F7",22858.79,1904.9,null,29500.22]
[null,"A3F7 39814",null,"2009-01-01","2010-03-31","--------","A3F7",24007.19,2000.6,null,30648.62]
[null,"A3F7 40269",null,"2010-04-01","2010-06-30",{"$f":"F380","v":"--------"},"A3F7",24007.19,2000.6,null,30648.62]
[null,"A3F7 40360",null,"2010-07-01","2015-12-31","--------","A3F7",24007.19,2000.6,null,30648.62]
[null,"A3F7 42370",null,"2016-01-01","2016-12-31",{"$f":"F382","v":"--------"},{"$f":"G382","v":"A3F7"},24148.79,2012.4,null,30790.22]
[null,"A3F7 42736",null,"2017-01-01","2018-02-28",{"$f":"F383","v":"--------"},{"$f":"G383","v":"A3F7"},24437.989999999998,2036.5,null,31079.42]
[null,"A3F7 43160",null,"2018-03-01","2018-03-31","--------","A3F7",25375.19,2114.6,null,32016.62]
[null,{"$f":"CONCATENATE(G386,\" \",D386)","v":"A3F7 43191"},null,"2018-04-01","2018-12-31",{"$f":"F382","v":"--------"},"A3F7",25605.05,{"$f":"ROUND(H386/12,2)","v":2133.75},null,32246.48]
[null,"A3F7 43466",null,"2019-01-01","2019-12-31",{"$f":"F386","v":"--------"},"A3F7",25891.85,2157.65,null,{"$f":"HLOOKUP(G387,'CCNL 2019-2021'!$M$22:$AB$27,'CCNL 2019-2021'!$K$23,FALSE)","v":32533.279999999999}]
[null,"A3F7 43831",null,"2020-01-01","2020-12-31","--------","A3F7",26185.85,2182.15,null,{"$f":"HLOOKUP(G388,'CCNL 2019-2021'!$M$22:$AB$27,'CCNL 2019-2021'!$K$24,FALSE)","v":32827.279999999999}]
[null,"A3F7 44197",null,"2021-01-01","2022-06-30","--------","A3F7",26973.050000000003,2247.75,null,{"$f":"HLOOKUP(G389,'CCNL 2019-2021'!$M$22:$AB$27,'CCNL 2019-2021'!$K$25,FALSE)","v":33614.480000000003}]
[null,"A3F7 44743",null,"2022-07-01","2022-10-31","--------","A3F7",26973.050000000003,2247.75,null,{"$f":"HLOOKUP(G390,'CCNL 2019-2021'!$M$22:$AB$27,'CCNL 2019-2021'!$K$26,FALSE)","v":33614.480000000003}]
[null,"A3F7 44866",null,"2022-11-01","9999-01-01","--------","A3F7",{"$f":"VLOOKUP(G391,$AH$28:$AI$43,2,FALSE)","v":16860.48},1405.04]

{"sheet":"CCNL 2019-2021","index":3,"n_rows":130,"n_cols":36,"rows_kept":130,"cut":false,"hidden":true,"merged":[[45,28,45,29],[46,28,46,29],[40,28,40,29],[41,28,41,29],[42,28,42,29],[43,28,43,29],[44,28,44,29],[35,28,35,29],[36,28,36,29],[37,28,37,29],[38,28,38,29],[39,28,39,29],[30,28,30,29],[31,28,31,29],[32,28,32,29],[33,28,33,29],[34,28,34,29],[28,1,30,1],[96,2,96,7],[97,2,97,7],[77,2,77,7],[52,24,54,24],[28,11,29,17],[52,21,54,23],[52,2,53,2],[52,4,54,4],[52,5,52,9],[76,2,76,7],[28,4,28,6],[28,7,28,9],[52,1,54,1],[52,11,53,19],[28,2,30,2],[20,30,24,35],[0,1,0,9],[1,1,3,1],[1,4,3,4],[1,5,1,9],[1,2,2,2],[1,30,2,35],[1,24,2,28],[3,11,3,13],[7,20,9,22],[1,11,1,18],[1,20,2,22]]}
[null,"IMPORTI ESPRESSI IN €URO "]
[null,"POSIZIONE ECONOMICA","RETRIBUZIONE TABELLARE ANNUA C.C.N.L.  2016/2018",null,"POSIZIONE ECONOMICA","RETRIBUZIONE TABELLARE ANNUA CCNL 2019/2021 ",null,null,null,null,null,"STIPENDIO ANNUO LORDO RAP\nCCNL 2019 - 2021",null,null,null,null,null,null,null,null,"Ulteriori incrementi mensili\ndella retribuzione tabellare.\nValori da corrispondere per 13 mensilità.\n\n\n",null,null,null,"ELEMENTO PEREQUATIVO dal 1°.03.2018 al 30.06.2022",null,null,null,null,null,"STIPENDIO ANNUO LORDO RAP - CCNL 2019 - 2021\ncon conglobamento Elemento Perequativo"]
[null,null,null,null,null,"TABELLA B1","TABELLA B1","TABELLA B1","TABELLA C1","TABELLA F"]
[null,null,"FINO AL 31/12/2018",null,null,"DAL\n1° GENNAIO 2019","DAL\n1° GENNAIO 2020","DAL\n1° GENNAIO 2021","DAL\n1° LUGLIO 2022","DAL\n1° NOVEMBRE 2022",null,null,null,null,"01.01.2019","01.01.2020","01.01.2021","01.07.2022","01.11.2022",null,"Ministeri",null,"Incrementi (1)\n€",null,null,null,null,"mensile x 12 mesi\n(no 13^)","annuo x 12 mesi\n(no 13^)",null,null,null,null,"01.01.2021","ELEMENTO PEREQUATIVO\ndal 01.01.2019 (1)","01.07.2022"]
[null,"A3F7",32246.48,null,"A3F7",{"$f":"O5","v":32533.279999999999},{"$f":"P5","v":32827.279999999999},{"$f":"Q5","v":33614.480000000003},{"$f":"R5","v":33614.480000000003},{"$f":"S5","v":23501.879999999997},null,"III","F",7,32533.279999999999,32827.279999999999,33614.480000000003,{"$f":"Q5+AI5","v":33614.480000000003},23501.879999999997,null,"Area","III",16.850000000000001,null,null,null,null,null,null,null,"III","F",7,33614.480000000003,0,33614.480000000003]
[null,"A3F6",30369,null,"A3F6",{"$f":"O6","v":30639},30916.2,31641,31641,23501.879999999997,null,"III","F",6,30639,30916.2,31641,{"$f":"Q6+AI6","v":31641},23501.879999999997,null,"Area","II",12.5,null,null,null,null,null,null,null,"III","F",6,31641,0,31641]
[null,"A3F5",28449.67,null,"A3F5",28702.87,28962.07,29655.67,29655.67,23501.879999999997,null,"III","F",5,28702.87,28962.07,29655.67,29655.67,23501.879999999997,null,"Area","I",12.27,null,null,null,null,null,null,null,"III","F",5,29655.67,0,29655.67]
[null,"A3F4",26718.84,null,"A3F4",26956.44,27200.04,27858.84,27858.84,23501.879999999997,null,"III","F",4,26956.44,27200.04,27858.84,27858.84,23501.879999999997,null,"(1) Decorrenti dalla data di applicazione del nuovo sistema di classificazione\nprofessionale",null,null,null,null,null,null,null,null,null,"III","F",4,27858.84,0,27858.84]
[null,"A3F3",24329.64,null,"A3F3",24545.64,24767.64,25373.64,25373.64,23501.879999999997,null,"III","F",3,24545.64,24767.64,25373.64,25373.64,23501.879999999997,null,null,null,null,null,null,null,null,null,null,null,"III","F",3,25373.64,0,25373.64]
[null,"A3F2",23074.61,null,"A3F2",23279.81,23489.81,24104.21,24104.21,23501.88,null,"III","F",2,23279.81,23489.81,24104.21,24104.21,23501.88,null,null,null,null,null,null,null,null,null,null,null,"III","F",2,24104.21,0,24104.21]
[null,"A3F1",22291.78,null,"A3F1",22489.78,22693.78,23299.78,23299.78,23501.88,null,"III","F",1,22489.78,22693.78,23299.78,23299.78,23501.88,null,null,null,null,null,null,null,null,null,null,null,"III","F",1,23299.78,0,23299.78]
[null,"A2F6",23014.93,null,"A2F6",23220.13,23430.13,24043.33,24043.33,19351.919999999998,null,"II","F",6,23220.13,23430.13,24043.33,24043.33,19351.919999999998,null,null,null,null,null,null,null,null,null,null,null,"II","F",6,24043.33,0,24043.33]
[null,"A2F5",22377.66,null,"A2F5",22576.86,22780.86,23386.86,23386.86,19351.919999999998,null,"II","F",5,22576.86,22780.86,23386.86,23386.86,19351.919999999998,null,null,null,null,null,null,null,null,null,null,null,"II","F",5,23386.86,0,23386.86]
[null,"A2F4",21594.959999999999,null,"A2F4",21786.959999999999,21983.759999999998,22518.959999999999,22793.040000000001,19351.919999999998,null,"II","F",4,21786.959999999999,21983.759999999998,22518.959999999999,22793.040000000001,19351.919999999998,null,null,null,null,null,"II","F",4,25.8,{"$f":"ROUND(AB14*12,2)","v":309.60000000000002},null,"II","F",4,22518.959999999999,274.08,22793.040000000001]
[null,"A2F3",20358.560000000001,null,"A2F3",20539.759999999998,20725.759999999998,21199.759999999998,21449.359999999997,19351.919999999998,null,"II","F",3,20539.759999999998,20725.759999999998,21199.759999999998,21449.359999999997,19351.919999999998,null,null,null,null,null,"II","F",3,23.5,{"$f":"ROUND(AB15*12,2)","v":282},null,"II","F",3,21199.759999999998,249.6,21449.360000000001]
[null,"A2F2",19132.150000000001,null,"A2F2",19302.55,19476.55,19930.150000000001,20167.030000000002,19351.920000000002,null,"II","F",2,19302.55,19476.55,19930.150000000001,20167.030000000002,19351.920000000002,null,null," ",null,null,"II","F",2,22.3,267.60000000000002,null,"II","F",2,19930.150000000001,236.88,20167.03]
[null,"A2F1",18203.28,null,"A2F1",18365.28,18530.88,18973.68,19202.04,19351.920000000002,null,"II","F",1,18365.28,18530.88,18973.68,19202.04,19351.920000000002,null,null,null,null,null,"II","F",1,21.5,258,null,"II","F",1,18973.68,228.36,19202.04]
[null,"A1F3",18523.93,null,"A1F3",18688.330000000002,18857.53,19315.93,19550.650000000001,18390.84,null,"I","F",3,18688.330000000002,18857.53,19315.93,19550.650000000001,18390.84,null,null,null,null,null,"I","F",3,22.1,265.2,null,"I","F",3,19315.93,234.72,19550.650000000001]
[null,"A1F2",17868.349999999999,null,"A1F2",18026.75,18189.95,18636.349999999999,18864.71,18390.84,null,"I","F",2,18026.75,18189.95,18636.349999999999,18864.71,18390.84,null,null,null,null,null,"I","F",2,21.5,258,null,"I","F",2,18636.349999999999,228.36,18864.71]
[null,"A1F1",17263.45,null,"A1F1",17417.05,17574.25,18019.45,18243.61,18390.84,null,"I","F",1,17417.05,17574.25,18019.45,18243.61,18390.84,null,null,null,null,null,"I","F",1,21.1,253.2,null,"I","F",1,18019.45,224.16,18243.61]
[null,null,null,null,null,null,null,null,null,null,null,null,null,null,null,null,null,null,null,null,null,null,null,null,null,null,null,null,null,null,"(1) I valori dell'elemento perequativo conglobati nello stipendio tabellare sono stati calcolati al netto dei\nmaggiori oneri per le amministrazioni derivanti dalla loro inclusione nello stipendio tabellare. A seguito del\nconglobamento, l'elemento perequativo cessa di essere corrisposto."]
[null,null,null,null,null,null,null,null,null,null,1,"dal","A3F7","A3F6","A3F5","A3F4","A3F3","A3F2","A3F1","A2F6","A2F5","A2F4","A2F3","A2F2","A2F1","A1F3","A1F2","A1F1"]
[null,null,null,null,null,null,null,null,null,null,2,"01.01.2019",{"$f":"VLOOKUP(M22,$E$5:$J$20,$K$23,FALSE)","v":32533.279999999999},{"$f":"VLOOKUP(N22,$E$5:$J$20,$K$23,FALSE)","v":30639},28702.87,26956.44,24545.64,23279.81,22489.78,23220.13,22576.86,21786.959999999999,20539.759999999998,19302.55,18365.28,18688.330000000002,18026.75,17417.05]
[null,null,null,null,null,null,null,null,null,null,3,"01.01.2020",{"$f":"VLOOKUP(M22,$E$5:$J$20,$K$24,FALSE)","v":32827.279999999999},{"$f":"VLOOKUP(N22,$E$5:$J$20,$K$24,FALSE)","v":30916.2},28962.07,27200.04,24767.64,23489.81,22693.78,23430.13,22780.86,21983.759999999998,20725.759999999998,19476.55,18530.88,18857.53,18189.95,17574.25]
[null,null,null,null,null,null,null,null,null,null,4,"01.01.2021",{"$f":"VLOOKUP(M22,$E$5:$J$20,$K$25,FALSE)","v":33614.480000000003},{"$f":"VLOOKUP(N22,$E$5:$J$20,$K$25,FALSE)","v":31641},29655.67,27858.84,25373.64,24104.21,23299.78,24043.33,23386.86,22518.959999999999,21199.759999999998,19930.150000000001,18973.68,19315.93,18636.349999999999,18019.45]
[null,null,null,null,null,null,null,null,null,null,5,"01.07.2022",{"$f":"VLOOKUP(M22,$E$5:$J$20,$K$26,FALSE)","v":33614.480000000003},{"$f":"VLOOKUP(N22,$E$5:$J$20,$K$26,FALSE)","v":31641},29655.67,27858.84,25373.64,24104.21,23299.78,24043.33,23386.86,22793.040000000001,21449.359999999997,20167.030000000002,19202.04,19550.650000000001,18864.71,18243.61]
[null,null,null,null,null,null,null,null,null,null,6,"01.11.2022",{"$f":"VLOOKUP(M22,$E$5:$J$20,$K$27,FALSE)","v":23501.879999999997},{"$f":"VLOOKUP(N22,$E$5:$J$20,$K$27,FALSE)","v":23501.879999999997},23501.879999999997,23501.879999999997,23501.879999999997,23501.88,23501.88,19351.919999999998,19351.919999999998,19351.919999999998,19351.919999999998,19351.920000000002,19351.920000000002,18390.84,18390.84,18390.84]
[]
[null,"POSIZIONE ECONOMICA","POSIZIONE ECONOMICA",null,"VACANZA CONTRATTUALE ANNUA ",null,null,"VACANZA CONTRATTUALE MENSILE",null,null,null,"MINISTERO DELL'ECONOMIA E DELLE FINANZE\nDIPARTIMENTO DELL’AMMINISTRAZIONE GENERALE,\nDEL PERSONALE E DEI SERVIZI\nDIREZIONE DEI SISTEMI INFORMATIVI E DELL’INNOVAZIONE"]
[]
[null,null,null,null,"DAL\n1° APRILE 2022","DAL\n1° LUGLIO 2022","DAL\n1° GENNAIO 2024","DAL\n1° APRILE 2022","DAL\n1° LUGLIO 2022","DAL\n1° GENNAIO 2024",null,"QUALIFICA","AREA","FASCIA","CODICE ASSEGNO IVC","SOTTOCODICE IVC","IMPORTO DAL 01/04/2022","IMPORTO DAL 01/07/2022",null,"NUOVO CODICE QUALIFICA","AMMINISTRAZIONE","NUOVA AREA","EX POSIZIONE ECONOMICA","FASCIA","NUOVA POSIZIONE ECONOMICA",null,"Codice assegno","Sottocodice assegno","Descrizione assegno\ncon imponibile contributivo x 13 mensilità",null,"Isolamento Imponibile lordo RAP x 13 mensilità",null,"Isolamento Imponibile lordo RAP x 12 mensilità","Isolamento Imponibile lordo RAP x 1 mensilità"]
[null,"XXC7","A3F7",null,{"$f":"ROUND(H5*0.3%,2)","v":100.84},{"$f":"ROUND(I5*0.5%,2)","v":168.07},{"$f":"AG32","v":1126.4000000000001},{"$f":"ROUND(E32/12,2)","v":8.4},{"$f":"ROUND(F32/12,2)","v":14.01},{"$f":"AH32","v":93.87},null,"XXC7","III","F7",119,"X17",8.06,13.44,null,"X001","DIFESA","FUNZIONARI","III F 7","F7",{"$f":"CONCATENATE(V32,\" \",X32)","v":"FUNZIONARI F7"},null,976,"X17","ANTICIPO RINNOVO CCNL 2022 - 2024 - 1220,27 Euro",null,1220.27,null,{"$f":"ROUND(AE32/13*12,2)","v":1126.4000000000001},{"$f":"ROUND(AG32/12,2)","v":93.87}]
[null,"XXC6","A3F6",null,94.92,158.21,1059.67,7.91,13.18,{"$f":"AH33","v":88.31},null,"XXC6","III","F6",119,"X15",7.59,12.65,null,"X002","DIFESA","FUNZIONARI","III F 6","F6",{"$f":"CONCATENATE(V33,\" \",X33)","v":"FUNZIONARI F6"},null,976,"X15","ANTICIPO RINNOVO CCNL 2022 - 2024 - 1147,98 Euro",null,1147.98,null,{"$f":"ROUND(AE33/13*12,2)","v":1059.67},{"$f":"ROUND(AG33/12,2)","v":88.31}]
[null,"XSC3","A3F5",null,88.97,148.28,993.75,7.41,12.36,{"$f":"AH34","v":82.81},null,"XSC3","III","F5",119,"X14",7.11,11.85,null,"X003","DIFESA","FUNZIONARI","III F 5","F5","FUNZIONARI F5",null,976,"X14","ANTICIPO RINNOVO CCNL 2022 - 2024 - 1076,56 Euro",null,1076.56,null,993.75,82.81]
[null,"XXC3","A3F4",null,83.58,139.29,933.44,6.97,11.61,{"$f":"AH35","v":77.790000000000006},null,"XXC3","III","F4",119,"X13",6.68,11.13,null,"X004","DIFESA","FUNZIONARI","III F 4","F4","FUNZIONARI F4",null,976,"X13","ANTICIPO RINNOVO CCNL 2022 - 2024 - 1011,23 Euro",null,1011.23,null,933.44,77.790000000000006]
[null,"XXC2","A3F3",null,76.12,126.87,849.83,6.34,10.57,70.819999999999993,null,"XXC2","III","F3",119,"X12",6.08,10.14,null,"X005","DIFESA","FUNZIONARI","III F 3","F3","FUNZIONARI F3",null,976,"X12","ANTICIPO RINNOVO CCNL 2022 - 2024 - 920,65 Euro",null,920.65,null,849.83,70.819999999999993]
[null,"XSC1","A3F2",null,72.31,120.52,807.21,6.03,10.039999999999999,67.27,null,"XSC1","III","F2",119,"X11",5.77,9.61,null,"X006","DIFESA","FUNZIONARI","III F 2","F2","FUNZIONARI F2",null,976,"X11","ANTICIPO RINNOVO CCNL 2022 - 2024 - 874,48 Euro",null,874.48,null,807.21,67.27]
[null,"XXC1","A3F1",null,69.900000000000006,116.5,780.68,5.83,9.7100000000000009,65.06,null,"XXC1","III","F1",119,"X08",5.57,9.2899999999999991,null,"X007","DIFESA","FUNZIONARI","III F 1","F1","FUNZIONARI F1",null,976,"X08","ANTICIPO RINNOVO CCNL 2022 - 2024 - 845,74 Euro",null,845.74,null,780.68,65.06]
[null,"XXB6","A2F6",null,72.13,120.22,805.61,6.01,10.02,67.13,null,"XXB6","II","F6",119,"X10",5.75,9.59,null,"X008","DIFESA","ASSISTENTI","II F 6","F6","ASSISTENTI F6",null,976,"X10","ANTICIPO RINNOVO CCNL 2022 - 2024 - 872,74 Euro",null,872.74,null,805.61,67.13]
[null,"XXB5","A2F5",null,70.16,116.93,783.09,5.85,9.74,65.260000000000005,null,"XXB5","II","F5",119,"X09",5.59,9.32,null,"X009","DIFESA","ASSISTENTI","II F 5","F5","ASSISTENTI F5",null,976,"X09","ANTICIPO RINNOVO CCNL 2022 - 2024 - 848,35 Euro",null,848.35,null,783.09,65.260000000000005]
[null,"XSB3","A2F4",null,67.56,113.97,763.8,5.63,9.5,63.65,null,"XSB3","II","F4",119,"X07",5.4,9,null,"X010","DIFESA","ASSISTENTI","II F 4","F4","ASSISTENTI F4",null,976,"X07","ANTICIPO RINNOVO CCNL 2022 - 2024 - 827,45 Euro",null,827.45,null,763.8,63.65]
[null,"XXB3","A2F3",null,63.6,107.25,718.77,5.3,8.94,59.9,null,"XXB3","II","F3",119,"X05",5.09,8.48,null,"X011","DIFESA","ASSISTENTI","II F 3","F3","ASSISTENTI F3",null,976,"X05","ANTICIPO RINNOVO CCNL 2022 - 2024 - 778,67 Euro",null,778.67,null,718.77,59.9]
[null,"XXB2","A2F2",null,59.79,100.84,675.36,4.9800000000000004,8.4,56.28,null,"XXB2","II","F2",119,"X04",4.78,7.97,null,"X012","DIFESA","ASSISTENTI","II F 2","F2","ASSISTENTI F2",null,976,"X04","ANTICIPO RINNOVO CCNL 2022 - 2024 - 731,64 Euro",null,731.64,null,675.36,56.28]
[null,"XXB1","A2F1",null,56.92,96.01,643.20000000000005,4.74,8,53.6,null,"XXB1","II","F1",119,"X03",4.55,7.58,null,"X013","DIFESA","ASSISTENTI","II F 1","F1","ASSISTENTI F1",null,976,"X03","ANTICIPO RINNOVO CCNL 2022 - 2024 - 696,8 Euro",null,696.8,null,643.20000000000005,53.6]
[null,"XXA3","A1F3",null,57.95,97.75,655.26,4.83,8.15,54.61,null,"XXA3","I","F3",119,"X06",4.63,7.72,null,"X014","DIFESA","OPERATORI","I F 3","F3","OPERATORI F3",null,976,"X06","ANTICIPO RINNOVO CCNL 2022 - 2024 - 709,87 Euro",null,709.87,null,655.26,54.61]
[null,"XSA1","A1F2",null,55.91,94.32,631.95000000000005,4.66,7.86,52.66,null,"XSA1","I","F2",119,"X02",4.47,7.45,null,"X015","DIFESA","OPERATORI","I F 2","F2","OPERATORI F2",null,976,"X02","ANTICIPO RINNOVO CCNL 2022 - 2024 - 684,61 Euro",null,684.61,null,631.95000000000005,52.66]
[null,"XXA1","A1F1",null,54.06,91.22,611.04,4.51,7.6,{"$f":"AH47","v":50.92},null,"XXA1","I","F1",119,"X01",4.32,7.19,null,"X016","DIFESA","OPERATORI","I F 1","F1","OPERATORI F1",null,976,"X01","ANTICIPO RINNOVO CCNL 2022 - 2024 - 661,96 Euro",null,661.96,null,611.04,50.92]
[]
[null,null,null,null,null,null,null,null,null,null,1,"dal","A3F7","A3F6","A3F5","A3F4","A3F3","A3F2","A3F1","A2F6","A2F5","A2F4","A2F3","A2F2","A2F1","A1F3","A1F2","A1F1"]
[null,null,null,null,null,null,null,null,null,null,2,"01.04.2022",{"$f":"VLOOKUP(M49,$C$32:$F$47,$K$50,FALSE)","v":0},0,0,0,0,0,0,0,0,0,0,0,0,0,0,0]
[null,null,null,null,null,null,null,null,null,null,3,"01.07.2022",{"$f":"VLOOKUP(M49,$C$32:$F$47,$K$51,FALSE)","v":100.84},94.92,88.97,83.58,76.12,72.31,69.900000000000006,72.13,70.16,67.56,63.6,59.79,56.92,57.95,55.91,54.06]
[]
[null,"POSIZIONE ECONOMICA","NDENNITA' DI AMM.NE ANNUA      TABELLA \"F\" CCNL 2006/2009",null,"POSIZIONE ECONOMICA","INDENNITA' DI AMMINISTRAZIONE ANNUA",null,null,null,null,null," Ministero dell’Economia e delle Finanze\nDipartimento dell’Amministrazione Generale, del Personale e dei Servizi\nDirezione dei Sistemi Informativi e dell'Innovazione - Ufficio IV",null,null,null,null,null,null,null,null,null,"CCNL 2019 - 2021\nINCREMENTO MENSILE\nMININISTERO DELLA DIFESA",null,null,"DAL 01.01.2021"]
[null,null,null,null,null,"DPCM 23.12.2021",null,"DPCM 23.12.2021","INCREMENTO CCNL 2019 - 2021","DPCM 23.12.2021 + CCNL 2019 - 2021"]
[null,null,"FINO AL 31/12/2019",null,null,"DAL\n1° GENNAIO 2020",null,"INIZIALE DAL\n1° GENNAIO 2021","INCREMENTO DAL\n1° GENNAIO 2021","DAL\n1° GENNAIO 2021",null,"CODICE ASSEGNO","SUBCODICE ASSEGNO","DESCRIZIONE ASSEGNO","DECORRENZA TABELLARE","SCADENZA TABELLARE","IMPORTO","DECORRENZA TABELLARE","SCADENZA TABELLARE","IMPORTO"]
[null,"A3F7",3370.44,null,"A3F7",{"$f":"ROUND(Q56*12,2)","v":4741.4399999999996},null,{"$f":"ROUND(T56*12,2)","v":4636.4399999999996},{"$f":"ROUND(Y56*12,2)","v":1082.52},{"$f":"H56+I56","v":5718.9599999999991},null,667,"R09","IND. AMM. MIN. DIFESA AREA III F4-F5-F6-F7- BASE","2020-01-01","2020-12-31",395.12,"2021-01-01","9999-01-01",386.37,null,"III","F",7,90.21]
[null,"A3F6",3370.44,null,"A3F6",{"$f":"ROUND(Q57*12,2)","v":4741.4399999999996},null,{"$f":"ROUND(T57*12,2)","v":4636.4399999999996},{"$f":"ROUND(Y57*12,2)","v":1082.52},{"$f":"H57+I57","v":5718.9599999999991},null,667,"R09","IND. AMM. MIN. DIFESA AREA III F4-F5-F6-F7- BASE","2020-01-01","2020-12-31",395.12,"2021-01-01","9999-01-01",386.37,null,"III","F",6,90.21]
[null,"A3F5",3370.44,null,"A3F5",4741.4399999999996,null,4636.4399999999996,1082.52,5718.9599999999991,null,667,"R09","IND. AMM. MIN. DIFESA AREA III F4-F5-F6-F7- BASE","2020-01-01","2020-12-31",395.12,"2021-01-01","9999-01-01",386.37,null,"III","F",5,90.21]
[null,"A3F4",3370.44,null,"A3F4",4741.4399999999996,null,4636.4399999999996,1082.52,5718.9599999999991,null,667,"R09","IND. AMM. MIN. DIFESA AREA III F4-F5-F6-F7- BASE","2020-01-01","2020-12-31",395.12,"2021-01-01","9999-01-01",386.37,null,"III","F",4,90.21]
[null,"A3F3",3112.08,null,"A3F3",4463.04,null,4385.04,1082.52,5467.5599999999995,null,667,"R08","IND. AMM. MIN. DIFESA AREA III F3- BASE","2020-01-01","2020-12-31",371.92,"2021-01-01","9999-01-01",365.42,null,"III","F",3,90.21]
[null,"A3F2",2772.72,null,"A3F2",4047.72,null,3993.72,1082.52,5076.24,null,667,"R07","IND. AMM. MIN. DIFESA AREA III F1-F2- BASE","2020-01-01","2020-12-31",337.31,"2021-01-01","9999-01-01",332.81,null,"III","F",2,90.21]
[null,"A3F1",2772.72,null,"A3F1",4047.72,null,3993.72,1082.52,5076.24,null,667,"R07","IND. AMM. MIN. DIFESA AREA III F1-F2- BASE","2020-01-01","2020-12-31",337.31,"2021-01-01","9999-01-01",332.81,null,"III","F",1,90.21]
[null,"A2F6",2483.2800000000002,null,"A2F6",3486.24,null,3407.28,866.28,4273.5600000000004,null,667,"R06","IND. AMM. MIN. DIFESA AREA II F3-F4-F5-F6- BASE","2020-01-01","2020-12-31",290.52,"2021-01-01","9999-01-01",283.94,null,"II","F",6,72.19]
[null,"A2F5",2483.2800000000002,null,"A2F5",3486.24,null,3407.28,866.28,4273.5600000000004,null,667,"R06","IND. AMM. MIN. DIFESA AREA II F3-F4-F5-F6- BASE","2020-01-01","2020-12-31",290.52,"2021-01-01","9999-01-01",283.94,null,"II","F",5,72.19]
[null,"A2F4",2483.2800000000002,null,"A2F4",3486.24,null,3407.28,866.28,4273.5600000000004,null,667,"R06","IND. AMM. MIN. DIFESA AREA II F3-F4-F5-F6- BASE","2020-01-01","2020-12-31",290.52,"2021-01-01","9999-01-01",283.94,null,"II","F",4,72.19]
[null,"A2F3",2483.2800000000002,null,"A2F3",3486.24,null,3407.28,866.28,4273.5600000000004,null,667,"R06","IND. AMM. MIN. DIFESA AREA II F3-F4-F5-F6- BASE","2020-01-01","2020-12-31",290.52,"2021-01-01","9999-01-01",283.94,null,"II","F",3,72.19]
[null,"A2F2",2246.4,null,"A2F2",3195.36,null,3133.44,866.28,3999.7200000000003,null,667,"R05","IND. AMM. MIN. DIFESA AREA II F2- BASE","2020-01-01","2020-12-31",266.27999999999997,"2021-01-01","9999-01-01",261.12,null,"II","F",2,72.19]
[null,"A2F1",2045.76,null,"A2F1",2996.76,null,2958.72,866.28,3825,null,667,"R04","IND. AMM. MIN. DIFESA AREA II F1- BASE","2020-01-01","2020-12-31",249.73,"2021-01-01","9999-01-01",246.56,null,"II","F",1,72.19]
[null,"A1F3",1834.2,null,"A1F3",2737.2,null,2715.24,644.16,3359.3999999999996,null,667,"R02","IND. AMM. MIN. DIFESA AREA I F1-F2-F3- BASE","2020-01-01","2020-12-31",228.1,"2021-01-01","9999-01-01",226.27,null,"I","F",3,53.68]
[null,"A1F2",1834.2,null,"A1F2",2737.2,null,2715.24,644.16,3359.3999999999996,null,667,"R02","IND. AMM. MIN. DIFESA AREA I F1-F2-F3- BASE","2020-01-01","2020-12-31",228.1,"2021-01-01","9999-01-01",226.27,null,"I","F",2,53.68]
[null,"A1F1",1834.2,null,"A1F1",2737.2,null,2715.24,644.16,3359.3999999999996,null,667,"R02","IND. AMM. MIN. DIFESA AREA I F1-F2-F3- BASE","2020-01-01","2020-12-31",228.1,"2021-01-01","9999-01-01",226.27,null,"I","F",1,53.68]
[]
[null,null,null,null,null,null,null,null,null,1,1,"dal","A3F7","A3F6","A3F5","A3F4","A3F3","A3F2","A3F1","A2F6","A2F5","A2F4","A2F3","A2F2","A2F1","A1F3","A1F2","A1F1"]
[null,null,null,null,null,null,null,null,null,2,2,"01.01.2020",{"$f":"VLOOKUP(M73,$E$56:$J$71,$K$74,FALSE)","v":4741.4399999999996},{"$f":"VLOOKUP(N73,$E$56:$J$71,$K$74,FALSE)","v":4741.4399999999996},4741.4399999999996,4741.4399999999996,4463.04,4047.72,4047.72,3486.24,3486.24,3486.24,3486.24,3195.36,2996.76,2737.2,2737.2,2737.2]
[null,null,null,null,null,null,null,null,null,3,6,"01.01.2021",{"$f":"VLOOKUP(M73,$E$56:$J$71,$K$75,FALSE)","v":5718.9599999999991},{"$f":"VLOOKUP(N73,$E$56:$J$71,$K$75,FALSE)","v":5718.9599999999991},5718.9599999999991,5718.9599999999991,5467.5599999999995,5076.24,5076.24,4273.5600000000004,4273.5600000000004,4273.5600000000004,4273.5600000000004,3999.7200000000003,3825,3359.3999999999996,3359.3999999999996,3359.3999999999996]
[]
[null,null,"DIFFERENZIALE ART. 52 CCNL 2019/2021\nE INDENNITA' DI AMMINISTRAZIONE ",null,null,null,null,null,"DPCM 23.12.2021 + CCNL 2019 - 2021","ART. 52\nCCNL 2019 - 2021"]
[null,null,"DAL 1° NOVEMBRE 2022",null,null,null,null,null,"IND. AMM.NE\nDIFESA","DIFFERENZIALE\nDIFESA"]
[null,null,{"$f":"CONCATENATE(H79,\" \",E79)","v":"A3F7 44866"},null,"2022-11-01","9999-01-01","--------","A3F7",4638,11110.44]
[null,null,{"$f":"CONCATENATE(H80,\" \",E80)","v":"A3F6 44866"},null,"2022-11-01","9999-01-01","--------","A3F6",4638,9136.92]
[null,null,{"$f":"CONCATENATE(H81,\" (\",G81,\") \",E81)","v":"A3F5 (C3S) 44866"},null,"2022-11-01","9999-01-01","C3S","A3F5",4638,7151.64]
[null,null,{"$f":"CONCATENATE(H82,\" (\",G82,\") \",E82)","v":"A3F4 (C3) 44866"},null,"2022-11-01","9999-01-01","C3","A3F4",4638,5354.76]
[null,null,"A3F3 (C2) 44866",null,"2022-11-01","9999-01-01","C2","A3F3",4638,2637.48]
[null,null,"A3F2 (C1S) 44866",null,"2022-11-01","9999-01-01","C1S","A3F2",4638,1006.8]
[null,null,"A3F1 (C1) 44866",null,"2022-11-01","9999-01-01","C1","A3F1",4638,202.44]
[null,null,{"$f":"CONCATENATE(H86,\" \",E86)","v":"A2F6 44866"},null,"2022-11-01","9999-01-01","--------","A2F6",3500.04,5405.4]
[null,null,"A2F5 44866",null,"2022-11-01","9999-01-01","--------","A2F5",3500.04,4749]
[null,null,{"$f":"CONCATENATE(H88,\" (\",G88,\") \",E88)","v":"A2F4 (B3S) 44866"},null,"2022-11-01","9999-01-01","B3S","A2F4",3500.04,4155.12]
[null,null,"A2F3 (B3) 44866",null,"2022-11-01","9999-01-01","B3","A2F3",3500.04,2811.48]
[null,null,"A2F2 (B2) 44866",null,"2022-11-01","9999-01-01","B2","A2F2",3500.04,1276.44]
[null,null,"A2F1 (B1) 44866",null,"2022-11-01","9999-01-01","B1","A2F1",3500.04,150.12]
[null,null,{"$f":"CONCATENATE(H92,\" \",E92)","v":"A1F3 44866"},null,"2022-11-01","9999-01-01","--------","A1F3",3040.32,1454.28]
[null,null,{"$f":"CONCATENATE(H93,\" (\",G93,\") \",E93)","v":"A1F2 (A1S) 44866"},null,"2022-11-01","9999-01-01","A1S","A1F2",3040.32,768.36]
[null,null,"A1F1 (A1) 44866",null,"2022-11-01","9999-01-01","A1","A1F1",3040.32,147.24]
[]
[]
[null,null,"DIFFERENZIALE ART. 52 CCNL 2019/2021\nE INDENNITA' DI AMMINISTRAZIONE ",null,null,null,null,null,null,"ART. 52\nCCNL 2019 - 2021"]
[null,null,"DAL 1° NOVEMBRE 2022",null,null,null,null,null,null,"DIFFERENZIALE\nDIFESA"]
[null,null,{"$f":"CONCATENATE(H99,\" (\",G99,\") \",E99)","v":"A1F1 (A1) 35977"},null,"1998-07-01","2022-10-31",{"$f":"G100","v":"A1"},{"$f":"H100","v":"A1F1"},null,0]
[null,null,{"$f":"CONCATENATE(H100,\" (\",G100,\") \",E100)","v":"A1F1 (A1) 44866"},null,"2022-11-01","9999-01-01","A1","A1F1",null,147.24]
[null,null,{"$f":"CONCATENATE(H101,\" (\",G101,\") \",E101)","v":"A1F2 (A1S) 35977"},null,"1998-07-01","2022-10-31",{"$f":"G102","v":"A1S"},{"$f":"H102","v":"A1F2"},null,0]
[null,null,{"$f":"CONCATENATE(H102,\" (\",G102,\") \",E102)","v":"A1F2 (A1S) 44866"},null,"2022-11-01","9999-01-01","A1S","A1F2",null,768.36]
[null,null,{"$f":"CONCATENATE(H103,\" \",E103)","v":"A1F3 35977"},null,"1998-07-01","2022-10-31",{"$f":"G104","v":"--------"},{"$f":"H104","v":"A1F3"},null,0]
[null,null,{"$f":"CONCATENATE(H104,\" \",E104)","v":"A1F3 44866"},null,"2022-11-01","9999-01-01","--------","A1F3",null,1454.28]
[null,null,{"$f":"CONCATENATE(H105,\" (\",G105,\") \",E105)","v":"A2F1 (B1) 35977"},null,"1998-07-01","2022-10-31",{"$f":"G106","v":"B1"},{"$f":"H106","v":"A2F1"},null,0]
[null,null,"A2F1 (B1) 44866",null,"2022-11-01","9999-01-01","B1","A2F1",null,150.12]
[null,null,"A2F2 (B2) 35977",null,"1998-07-01","2022-10-31",{"$f":"G108","v":"B2"},{"$f":"H108","v":"A2F2"},null,0]
[null,null,"A2F2 (B2) 44866",null,"2022-11-01","9999-01-01","B2","A2F2",null,1276.44]
[null,null,"A2F3 (B3) 35977",null,"1998-07-01","2022-10-31",{"$f":"G110","v":"B3"},{"$f":"H110","v":"A2F3"},null,0]
[null,null,"A2F3 (B3) 44866",null,"2022-11-01","9999-01-01","B3","A2F3",null,2811.48]
[null,null,{"$f":"CONCATENATE(H111,\" (\",G111,\") \",E111)","v":"A2F4 (B3S) 35977"},null,"1998-07-01","2022-10-31",{"$f":"G112","v":"B3S"},{"$f":"H112","v":"A2F4"},null,0]
[null,null,{"$f":"CONCATENATE(H112,\" (\",G112,\") \",E112)","v":"A2F4 (B3S) 44866"},null,"2022-11-01","9999-01-01","B3S","A2F4",null,4155.12]
[null,null,{"$f":"CONCATENATE(H113,\" \",E113)","v":"A2F5 35977"},null,"1998-07-01","2022-10-31",{"$f":"G114","v":"--------"},{"$f":"H114","v":"A2F5"},null,0]
[null,null,{"$f":"CONCATENATE(H114,\" \",E114)","v":"A2F5 44866"},null,"2022-11-01","9999-01-01","--------","A2F5",null,4749]
[null,null,{"$f":"CONCATENATE(H115,\" \",E115)","v":"A2F6 35977"},null,"1998-07-01","2022-10-31",{"$f":"G116","v":"--------"},{"$f":"H116","v":"A2F6"},null,0]
[null,null,{"$f":"CONCATENATE(H116,\" \",E116)","v":"A2F6 44866"},null,"2022-11-01","9999-01-01","--------","A2F6",null,5405.4]
[null,null,{"$f":"CONCATENATE(H117,\" (\",G117,\") \",E117)","v":"A3F1 (C1) 35977"},null,"1998-07-01","2022-10-31",{"$f":"G118","v":"C1"},{"$f":"H118","v":"A3F1"},null,0]
[null,null,{"$f":"CONCATENATE(H118,\" (\",G118,\") \",E118)","v":"A3F1 (C1) 44866"},null,"2022-11-01","9999-01-01","C1","A3F1",null,202.44]
[null,null,{"$f":"CONCATENATE(H119,\" (\",G119,\") \",E119)","v":"A3F2 (C1S) 35977"},null,"1998-07-01","2022-10-31",{"$f":"G120","v":"C1S"},{"$f":"H120","v":"A3F2"},null,0]
[null,null,{"$f":"CONCATENATE(H120,\" (\",G120,\") \",E120)","v":"A3F2 (C1S) 44866"},null,"2022-11-01","9999-01-01","C1S","A3F2",null,1006.8]
[null,null,{"$f":"CONCATENATE(H121,\" (\",G121,\") \",E121)","v":"A3F3 (C2) 35977"},null,"1998-07-01","2022-10-31",{"$f":"G122","v":"C2"},{"$f":"H122","v":"A3F3"},null,0]
[null,null,{"$f":"CONCATENATE(H122,\" (\",G122,\") \",E122)","v":"A3F3 (C2) 44866"},null,"2022-11-01","9999-01-01","C2","A3F3",null,2637.48]
[null,null,{"$f":"CONCATENATE(H123,\" (\",G123,\") \",E123)","v":"A3F4 (C3) 35977"},null,"1998-07-01","2022-10-31",{"$f":"G124","v":"C3"},{"$f":"H124","v":"A3F4"},null,0]
[null,null,{"$f":"CONCATENATE(H124,\" (\",G124,\") \",E124)","v":"A3F4 (C3) 44866"},null,"2022-11-01","9999-01-01","C3","A3F4",null,5354.76]
[null,null,{"$f":"CONCATENATE(H125,\" (\",G125,\") \",E125)","v":"A3F5 (C3S) 35977"},null,"1998-07-01","2022-10-31",{"$f":"G126","v":"C3S"},{"$f":"H126","v":"A3F5"},null,0]
[null,null,{"$f":"CONCATENATE(H126,\" (\",G126,\") \",E126)","v":"A3F5 (C3S) 44866"},null,"2022-11-01","9999-01-01","C3S","A3F5",null,7151.64]
[null,null,{"$f":"CONCATENATE(H127,\" \",E127)","v":"A3F6 35977"},null,"1998-07-01","2022-10-31",{"$f":"G128","v":"--------"},{"$f":"H128","v":"A3F6"},null,0]
[null,null,{"$f":"CONCATENATE(H128,\" \",E128)","v":"A3F6 44866"},null,"2022-11-01","9999-01-01","--------","A3F6",null,9136.92]
[null,null,{"$f":"CONCATENATE(H129,\" \",E129)","v":"A3F7 35977"},null,"1998-07-01","2022-10-31",{"$f":"G130","v":"--------"},{"$f":"H130","v":"A3F7"},null,0]
[null,null,{"$f":"CONCATENATE(H130,\" \",E130)","v":"A3F7 44866"},null,"2022-11-01","9999-01-01","--------","A3F7",null,11110.44]

{"sheet":"IND. INT. SPEC.","index":4,"n_rows":61,"n_cols":22,"rows_kept":61,"cut":false,"hidden":true,"merged":[[1,1,3,1],[7,12,13,12],[14,12,19,12],[20,12,22,12],[41,3,42,5],[41,6,41,8],[42,6,43,6],[42,7,43,7],[42,8,44,8],[43,3,44,3],[43,4,44,4],[43,5,44,5],[1,3,1,8],[2,3,2,8]]}
[]
[null,"CCNL\nINTEGRATIVO\n16-05-2001",null,"IND. INT. SPEC."]
[null,null,null,"PER L E POSIZIONI \"SUPER\", STESSI IMPORTI DELLE POSIZIONI \"NORMALI\""]
[null,null,null,"DAL","AL","POS. ECON.","FASCE NELLE AREE","ANNUO LORDO","MENSILE LORDO"]
[null,null,null,"A","A1",null,null,null,null,null,null,null,"TABELLA \"A\""]
[null,{"$f":"CONCATENATE(G6,\" (\",F6,\") \",D6)","v":"A1F1 (A1) 33543"},null,"1991-11-01","2022-10-31","A1","A1F1",{"$f":"ROUND(ROUND(VLOOKUP(G6,$O$8:$P$35,2,FALSE)/1936.27,2)/13*12,2)","v":6235.76},{"$f":"ROUND(H6/12,2)","v":519.65},null,null,null,"INDENNITA' INTEGRATIVA SPECIALE *",null,null,null,null,null,null,null,{"$f":"ROUND(VLOOKUP(G6,$O$8:$P$35,2,FALSE)/1936.27/13*12,2)","v":6235.76},{"$f":"EXACT(U6,H6)","v":true}]
[null,{"$f":"CONCATENATE(G7,\" (\",F7,\") \",D7)","v":"A1F1 (A1) 44866"},null,"2022-11-01","9999-01-01",{"$f":"F6","v":"A1"},{"$f":"G6","v":"A1F1"},{"$f":"VLOOKUP(G7,$F$46:$H$61,3,FALSE)","v":6235.8},{"$f":"ROUND(H7/12,2)","v":519.65}]
[null,{"$f":"CONCATENATE(G8,\" (\",F8,\") \",D8)","v":"A1F2 (A1S) 33543"},null,"1991-11-01","2022-10-31","A1S","A1F2",{"$f":"ROUND(ROUND(VLOOKUP(G8,$O$8:$P$35,2,FALSE)/1936.27,2)/13*12,2)","v":6235.76},{"$f":"ROUND(H8/12,2)","v":519.65},null,null,null,"C",null,"A3F7",{"$f":"P9","v":13931229},null,null,null,null,{"$f":"ROUND(VLOOKUP(G8,$O$8:$P$35,2,FALSE)/1936.27/13*12,2)","v":6235.76},{"$f":"EXACT(U8,H8)","v":true}]
[null,{"$f":"CONCATENATE(G9,\" (\",F9,\") \",D9)","v":"A1F2 (A1S) 44866"},null,"2022-11-01","9999-01-01",{"$f":"F8","v":"A1S"},{"$f":"G8","v":"A1F2"},{"$f":"VLOOKUP(G9,$F$46:$H$61,3,FALSE)","v":6235.8},{"$f":"ROUND(H9/12,2)","v":519.65},null,null,null,null,null,"A3F6",{"$f":"P10","v":13931229}]
[null,{"$f":"CONCATENATE(G10,\" \",D10)","v":"A1F3 39447"},null,"2007-12-31","2022-10-31","--------","A1F3",{"$f":"ROUND(ROUND(VLOOKUP(G10,$O$8:$P$35,2,FALSE)/1936.27,2)/13*12,2)","v":6235.76},519.65,null,null,null,null,null,"A3F5",{"$f":"P11","v":13931229},null,null,null,null,{"$f":"ROUND(VLOOKUP(G10,$O$8:$P$35,2,FALSE)/1936.27/13*12,2)","v":6235.76},{"$f":"EXACT(U10,H10)","v":true}]
[null,"A1F3 44866",null,"2022-11-01","9999-01-01",{"$f":"F10","v":"--------"},{"$f":"G10","v":"A1F3"},{"$f":"VLOOKUP(G11,$F$46:$H$61,3,FALSE)","v":6235.8},{"$f":"ROUND(H11/12,2)","v":519.65},null,null,null,null,"C3","A3F4",13931229]
[null,null,null,"B","A2",null,null,null,null,null,null,null,null,"C2","A3F3",13729456,null,null,null,null,null," "]
[null,{"$f":"CONCATENATE(G13,\" (\",F13,\") \",D13)","v":"A2F1 (B1) 33543"},null,"1991-11-01","2022-10-31","B1","A2F1",{"$f":"ROUND(ROUND(VLOOKUP(G13,$O$8:$P$35,2,FALSE)/1936.27,2)/13*12,2)","v":6277.62},{"$f":"ROUND(H13/12,2)","v":523.14},null,null,null,null,null,"A3F2",{"$f":"P14","v":13521001},null,null,null,null,{"$f":"ROUND(VLOOKUP(G13,$O$8:$P$35,2,FALSE)/1936.27/13*12,2)","v":6277.62},{"$f":"EXACT(U13,H13)","v":true}]
[null,{"$f":"CONCATENATE(G14,\" (\",F14,\") \",D14)","v":"A2F1 (B1) 44866"},null,"2022-11-01","9999-01-01",{"$f":"F13","v":"B1"},{"$f":"G13","v":"A2F1"},{"$f":"VLOOKUP(G14,$F$46:$H$61,3,FALSE)","v":6277.56},{"$f":"ROUND(H14/12,2)","v":523.13},null,null,null,null,"C1","A3F1",13521001]
[null,"A2F2 (B2) 33543",null,"1991-11-01","2022-10-31","B2","A2F2",{"$f":"ROUND(ROUND(VLOOKUP(G15,$O$8:$P$35,2,FALSE)/1936.27,2)/13*12,2)","v":6317.83},526.49,null,null,null,"B",null,"A2F6",{"$f":"P16","v":13364065},null,null,null,null,{"$f":"ROUND(VLOOKUP(G15,$O$8:$P$35,2,FALSE)/1936.27/13*12,2)","v":6317.83},{"$f":"EXACT(U15,H15)","v":true}]
[null,{"$f":"CONCATENATE(G16,\" (\",F16,\") \",D16)","v":"A2F2 (B2) 44866"},null,"2022-11-01","9999-01-01",{"$f":"F15","v":"B2"},{"$f":"G15","v":"A2F2"},{"$f":"VLOOKUP(G16,$F$46:$H$61,3,FALSE)","v":6317.88},{"$f":"ROUND(H16/12,2)","v":526.49},null,null,null,null,null,"A2F5",{"$f":"P17","v":13364065}]
[null,"A2F3 (B3) 33543",null,"1991-11-01","2022-10-31","B3","A2F3",{"$f":"ROUND(ROUND(VLOOKUP(G17,$O$8:$P$35,2,FALSE)/1936.27,2)/13*12,2)","v":6371.04},530.91999999999996,null,null,null,null,null,"A2F4",{"$f":"P18","v":13364065},null,null,null,null,{"$f":"ROUND(VLOOKUP(G17,$O$8:$P$35,2,FALSE)/1936.27/13*12,2)","v":6371.04},{"$f":"EXACT(U17,H17)","v":true}]
[null,{"$f":"CONCATENATE(G18,\" (\",F18,\") \",D18)","v":"A2F3 (B3) 44866"},null,"2022-11-01","9999-01-01",{"$f":"F17","v":"B3"},{"$f":"G17","v":"A2F3"},{"$f":"VLOOKUP(G18,$F$46:$H$61,3,FALSE)","v":6371.04},{"$f":"ROUND(H18/12,2)","v":530.91999999999996},null,null,null,null,"B3","A2F3",13364065]
[null,"A2F4 (B3S) 33543",null,"1991-11-01","2022-10-31","B3S","A2F4",{"$f":"ROUND(ROUND(VLOOKUP(G19,$O$8:$P$35,2,FALSE)/1936.27,2)/13*12,2)","v":6371.04},530.91999999999996,null,null,null,null,"B2","A2F2",13252447,null,null,null,null,{"$f":"ROUND(VLOOKUP(G19,$O$8:$P$35,2,FALSE)/1936.27/13*12,2)","v":6371.04},{"$f":"EXACT(U19,H19)","v":true}]
[null,{"$f":"CONCATENATE(G20,\" (\",F20,\") \",D20)","v":"A2F4 (B3S) 44866"},null,"2022-11-01","9999-01-01",{"$f":"F19","v":"B3S"},{"$f":"G19","v":"A2F4"},{"$f":"VLOOKUP(G20,$F$46:$H$61,3,FALSE)","v":6371.04},{"$f":"ROUND(H20/12,2)","v":530.91999999999996},null,null,null,null,"B1","A2F1",13168103]
[null,{"$f":"CONCATENATE(G21,\" \",D21)","v":"A2F5 39447"},null,"2007-12-31","2022-10-31","--------","A2F5",{"$f":"ROUND(ROUND(VLOOKUP(G21,$O$8:$P$35,2,FALSE)/1936.27,2)/13*12,2)","v":6371.04},530.91999999999996,null,null,null,"A",null,"A1F3",{"$f":"P22","v":13080301},null,null,null,null,{"$f":"ROUND(VLOOKUP(G21,$O$8:$P$35,2,FALSE)/1936.27/13*12,2)","v":6371.04},{"$f":"EXACT(U21,H21)","v":true}]
[null,"A2F5 44866",null,"2022-11-01","9999-01-01",{"$f":"F21","v":"--------"},{"$f":"G21","v":"A2F5"},{"$f":"VLOOKUP(G22,$F$46:$H$61,3,FALSE)","v":6371.04},{"$f":"ROUND(H22/12,2)","v":530.91999999999996},null,null,null,null,null,"A1F2",{"$f":"P23","v":13080301}]
[null,"A2F6 39447",null,"2007-12-31","2022-10-31","--------","A2F6",{"$f":"ROUND(ROUND(VLOOKUP(G23,$O$8:$P$35,2,FALSE)/1936.27,2)/13*12,2)","v":6371.04},530.91999999999996,null,null,null,null,"A1","A1F1",13080301,null,null,null,null,{"$f":"ROUND(VLOOKUP(G23,$O$8:$P$35,2,FALSE)/1936.27/13*12,2)","v":6371.04},{"$f":"EXACT(U23,H23)","v":true}]
[null,"A2F6 44866",null,"2022-11-01","9999-01-01",{"$f":"F23","v":"--------"},{"$f":"G23","v":"A2F6"},{"$f":"VLOOKUP(G24,$F$46:$H$61,3,FALSE)","v":6371.04},{"$f":"ROUND(H24/12,2)","v":530.91999999999996}]
[null,null,null,"C","A3",null,null,null,null,null,null,null,"*(annua lorda comprensiva del rateo della tredicesima mensilità)"]
[null,{"$f":"CONCATENATE(G26,\" (\",F26,\") \",D26)","v":"A3F1 (C1) 33543"},null,"1991-11-01","2022-10-31","C1","A3F1",{"$f":"ROUND(ROUND(VLOOKUP(G26,$O$8:$P$35,2,FALSE)/1936.27,2)/13*12,2)","v":6445.86},{"$f":"ROUND(H26/12,2)","v":537.16},null,null,null,null,null,null,null,null,null,null,null,{"$f":"ROUND(VLOOKUP(G26,$O$8:$P$35,2,FALSE)/1936.27/13*12,2)","v":6445.86},{"$f":"EXACT(U26,H26)","v":true}]
[null,{"$f":"CONCATENATE(G27,\" (\",F27,\") \",D27)","v":"A3F1 (C1) 44866"},null,"2022-11-01","9999-01-01",{"$f":"F26","v":"C1"},{"$f":"G26","v":"A3F1"},{"$f":"VLOOKUP(G27,$F$46:$H$61,3,FALSE)","v":6445.8},{"$f":"ROUND(H27/12,2)","v":537.15}]
[null,"A3F2 (C1S) 33543",null,"1991-11-01","2022-10-31","C1S","A3F2",{"$f":"ROUND(ROUND(VLOOKUP(G28,$O$8:$P$35,2,FALSE)/1936.27,2)/13*12,2)","v":6445.86},537.16,null,null,null,null,null,null,null,null,null,null,null,{"$f":"ROUND(VLOOKUP(G28,$O$8:$P$35,2,FALSE)/1936.27/13*12,2)","v":6445.86},{"$f":"EXACT(U28,H28)","v":true}]
[null,{"$f":"CONCATENATE(G29,\" (\",F29,\") \",D29)","v":"A3F2 (C1S) 44866"},null,"2022-11-01","9999-01-01",{"$f":"F28","v":"C1S"},{"$f":"G28","v":"A3F2"},{"$f":"VLOOKUP(G29,$F$46:$H$61,3,FALSE)","v":6445.8},{"$f":"ROUND(H29/12,2)","v":537.15}]
[null,"A3F3 (C2) 33543",null,"1991-11-01","2022-10-31","C2","A3F3",{"$f":"ROUND(ROUND(VLOOKUP(G30,$O$8:$P$35,2,FALSE)/1936.27,2)/13*12,2)","v":6545.23},545.44000000000005,null,null,null,null,null,null,null,null,null,null,null,{"$f":"ROUND(VLOOKUP(G30,$O$8:$P$35,2,FALSE)/1936.27/13*12,2)","v":6545.24},{"$f":"EXACT(U30,H30)","v":false}]
[null,{"$f":"CONCATENATE(G31,\" (\",F31,\") \",D31)","v":"A3F3 (C2) 44866"},null,"2022-11-01","9999-01-01",{"$f":"F30","v":"C2"},{"$f":"G30","v":"A3F3"},{"$f":"VLOOKUP(G31,$F$46:$H$61,3,FALSE)","v":6545.28},{"$f":"ROUND(H31/12,2)","v":545.44000000000005}]
[null,"A3F4 (C3) 33543",null,"1991-11-01","2022-10-31","C3","A3F4",{"$f":"ROUND(ROUND(VLOOKUP(G32,$O$8:$P$35,2,FALSE)/1936.27,2)/13*12,2)","v":6641.43},553.45000000000005,null,null,null,null,null,null,null," ",null," ",null,{"$f":"ROUND(VLOOKUP(G32,$O$8:$P$35,2,FALSE)/1936.27/13*12,2)","v":6641.43},{"$f":"EXACT(U32,H32)","v":true}]
[null,{"$f":"CONCATENATE(G33,\" (\",F33,\") \",D33)","v":"A3F4 (C3) 44866"},null,"2022-11-01","9999-01-01",{"$f":"F32","v":"C3"},{"$f":"G32","v":"A3F4"},{"$f":"VLOOKUP(G33,$F$46:$H$61,3,FALSE)","v":6641.4},{"$f":"ROUND(H33/12,2)","v":553.45000000000005}]
[null,"A3F5 (C3S) 33543",null,"1991-11-01","2022-10-31","C3S","A3F5",{"$f":"ROUND(ROUND(VLOOKUP(G34,$O$8:$P$35,2,FALSE)/1936.27,2)/13*12,2)","v":6641.43},553.45000000000005,null,null," ",null,null,null,null,null,null,null,null,{"$f":"ROUND(VLOOKUP(G34,$O$8:$P$35,2,FALSE)/1936.27/13*12,2)","v":6641.43},{"$f":"EXACT(U34,H34)","v":true}]
[null,{"$f":"CONCATENATE(G35,\" (\",F35,\") \",D35)","v":"A3F5 (C3S) 44866"},null,"2022-11-01","9999-01-01",{"$f":"F34","v":"C3S"},{"$f":"G34","v":"A3F5"},{"$f":"VLOOKUP(G35,$F$46:$H$61,3,FALSE)","v":6641.4},{"$f":"ROUND(H35/12,2)","v":553.45000000000005}]
[null,{"$f":"CONCATENATE(G36,\" \",D36)","v":"A3F6 39447"},null,"2007-12-31","2022-10-31","--------","A3F6",{"$f":"ROUND(ROUND(VLOOKUP(G36,$O$8:$P$35,2,FALSE)/1936.27,2)/13*12,2)","v":6641.43},553.45000000000005,null," ",null,null,null,null,null,null," ",null,null,{"$f":"ROUND(VLOOKUP(G36,$O$8:$P$35,2,FALSE)/1936.27/13*12,2)","v":6641.43},{"$f":"EXACT(U36,H36)","v":true}]
[null,"A3F6 44866",null,"2022-11-01","9999-01-01",{"$f":"F36","v":"--------"},{"$f":"G36","v":"A3F6"},{"$f":"VLOOKUP(G37,$F$46:$H$61,3,FALSE)","v":6641.4},{"$f":"ROUND(H37/12,2)","v":553.45000000000005}]
[null,"A3F7 39447",null,"2007-12-31","2022-10-31","--------","A3F7",{"$f":"ROUND(ROUND(VLOOKUP(G38,$O$8:$P$35,2,FALSE)/1936.27,2)/13*12,2)","v":6641.43},553.45000000000005,null,null,null,null,null,null,null,null,null,null,null,{"$f":"ROUND(VLOOKUP(G38,$O$8:$P$35,2,FALSE)/1936.27/13*12,2)","v":6641.43},{"$f":"EXACT(U38,H38)","v":true}]
[null,"A3F7 44866",null,"2022-11-01","9999-01-01",{"$f":"F38","v":"--------"},{"$f":"G38","v":"A3F7"},{"$f":"VLOOKUP(G39,$F$46:$H$61,3,FALSE)","v":6641.4},{"$f":"ROUND(H39/12,2)","v":553.45000000000005}]
[]
[null,null,null,null,null,null,null,null,null,null,null," ",null,null,null,null,null,null,null," "]
[null,null,null,"TABELLARI NOIPA\nDAL 01.11.2022",null,null,"DAL\n1° NOVEMBRE 2022"]
[null,null,null,null,null,null,"ART. 52\nCCNL 19 - 21","CCNL INT. 16.05.2001","TOTALE ANNUO"]
[null,null,null,"AREA","FASCIA\nRETRIBUTIVA","AREA/\nFASCIA"]
[null,null,null,null,null,null,"STIPENDIO","IND. INT. SPEC.",null,null,null,null,null,null,null,null,null,null,null,null," "]
[null,null,null,"FUNZIONARI","F7","A3F7",16860.48,6641.4,23501.879999999997]
[null,null,null,"FUNZIONARI","F6","A3F6",16860.48,6641.4,23501.879999999997]
[null,null,null,"FUNZIONARI","F5","A3F5",16860.48,6641.4,23501.879999999997,null,null,null," "]
[null,null,null,"FUNZIONARI","F4","A3F4",16860.48,6641.4,23501.879999999997]
[null,null,null,"FUNZIONARI","F3","A3F3",16956.599999999999,6545.28,23501.879999999997,null,null,null,null,null,null," "]
[null,null,null,"FUNZIONARI","F2","A3F2",17056.080000000002,6445.8,23501.88]
[null,null,null,"FUNZIONARI","F1","A3F1",17056.080000000002,6445.8,23501.88]
[null,null,null,"ASSISTENTI","F6","A2F6",12980.88,6371.04,19351.919999999998]
[null,null,null,"ASSISTENTI","F5","A2F5",12980.88,6371.04,19351.919999999998]
[null,null,null,"ASSISTENTI","F4","A2F4",12980.88,6371.04,19351.919999999998]
[null,null,null,"ASSISTENTI","F3","A2F3",12980.88,6371.04,19351.919999999998," "]
[null,null,null,"ASSISTENTI","F2","A2F2",13034.04,6317.88,19351.920000000002,null," "]
[null,null,null,"ASSISTENTI","F1","A2F1",13074.36,6277.56,19351.920000000002]
[null,null,null,"OPERATORI","F3","A1F3",12155.04,6235.8,18390.84]
[null,null,null,"OPERATORI","F2","A1F2",12155.04,6235.8,18390.84]
[null,null,null,"OPERATORI","F1","A1F1",12155.04,6235.8,18390.84]

{"sheet":"IND. AMM.NE","index":5,"n_rows":336,"n_cols":82,"rows_kept":336,"cut":false,"hidden":true,"merged":[[1,4,1,10],[2,4,2,6],[285,21,287,21],[286,24,286,25],[285,22,286,22],[285,23,286,23],[334,2,334,9],[285,24,285,25],[287,22,287,25],[288,21,289,21],[323,2,323,6],[324,2,324,6],[325,2,325,6],[309,2,309,9],[333,2,333,9],[326,2,326,6],[327,2,327,6],[310,7,310,9],[328,2,328,6],[330,2,330,6],[331,2,331,6],[309,0,311,1],[332,0,335,1],[310,2,311,6],[312,2,312,6],[313,2,313,6],[314,2,314,6],[315,2,315,6],[316,2,316,6],[317,2,317,6],[318,2,318,6],[319,2,319,6],[320,2,320,6],[321,2,321,6],[322,2,322,6],[335,2,335,9],[332,2,332,9]]}
[]
[null,null,null,null,"IND. AMM.NE ",null,null,null,null,null,null,"Importi\nNoiPA",null,"Importi Calcolati",null,null,null,null,null,null,null,"ELENCO DINAMICO: ALTRE_AMM.NI",null,null,null,null,null,null,null,"ELENCO DINAMICO: ALTRE_AMM.NI_2",null,null,null,null,null,null,"ELENCO DINAMICO: ALTRE_AMM.NI_3",null,null,null,null,null,null,"ELENCO DINAMICO: ALTRE_AMM.NI_4",null,null,null,null,null,null,"ELENCO DINAMICO: ALTRE_AMM.NI_5",null,null,null,null,null,null,"ELENCO DINAMICO: ALTRE_AMM.NI_6"]
[null,null,null,null,"PER L E POSIZIONI \"SUPER\", STESSI IMPORTI DELLE POSIZIONI \"NORMALI\"",null,null,null,"BASE","OP.VA","IND.LE","BASE",null,"BASE",null,null,null,null,null,null,"SIGLA","AMMINISTRAZIONI",null,null,null,null,null,"SIGLA",null,"AMMINISTRAZIONI",null,null,null,null,null,null,"AMMINISTRAZIONI",null,null,null,null,null,null,"AMMINISTRAZIONI",null,null,null,null,null,null,"AMMINISTRAZIONI",null,null,null,null,null,null,"AMMINISTRAZIONI"]
[null,null,null,null,"DAL","AL","POS. ECON.","FASCE NELLE AREE","MENSILE LORDO","MENSILE LORDO","MENSILE LORDO","ANNUO LORDO",null,"MENSILE LORDO","ANNUO LORDO",null,null,null,null,null,"MAE","AFFARI ESTERI E COOPERAZIONE INTERNAZIONALE",null,null,null,null,null,"MAE",null,{"$f":"IF(INSERIMENTO!$J$17>0,V4,\"\")","v":"AFFARI ESTERI E COOPERAZIONE INTERNAZIONALE"},null,null,null,null,null,null,{"$f":"IF(INSERIMENTO!$J$19>0,AD4,\"\")","v":""},null,null,null,null,null,null,{"$f":"IF(INSERIMENTO!$J$21>0,AK4,\"\")","v":""},null,null,null,null,null,null,{"$f":"IF(INSERIMENTO!$J$23>0,AR4,\"\")","v":""},null,null,null,null,null,null,{"$f":"IF(INSERIMENTO!$J$25>0,AY4,\"\")","v":""}]
[null,null,null,null,"A1","A1F1",null,null,null,null,null,null,null,null,null,null,null,null,null,null,"AVV","AVVOCATURA",null,null,null,null,null,"AVV",null,{"$f":"IF(INSERIMENTO!$J$17>0,V5,\"\")","v":"AVVOCATURA"},null,null,null,null,null,null,{"$f":"IF(INSERIMENTO!$J$19>0,AD5,\"\")","v":""},null,null,null,null,null,null,{"$f":"IF(INSERIMENTO!$J$21>0,AK5,\"\")","v":""},null,null,null,null,null,null,{"$f":"IF(INSERIMENTO!$J$23>0,AR5,\"\")","v":""},null,null,null,null,null,null,{"$f":"IF(INSERIMENTO!$J$25>0,AY5,\"\")","v":""}]
[null,{"$f":"CONCATENATE(H6,\" \",E6)","v":"A1F1 34700"},{"$f":"CONCATENATE(H6,\" (\",G6,\") \",E6)","v":"A1F1 (A1) 34700"},null,"1995-01-01","1997-06-30","A1","A1F1",83.15,88.31,90.9,{"$f":"ROUND(I6*12,2)","v":997.8},null,null,{"$f":"ROUND(I6*12,2)","v":997.8},null,null,null,null,null,"CDS","CONSIGLIO DI STATO",null,null,null,null,null,"CDS",null,{"$f":"IF(INSERIMENTO!$J$17>0,V6,\"\")","v":"CONSIGLIO DI STATO"},null,null,null,null,null,null,{"$f":"IF(INSERIMENTO!$J$19>0,AD6,\"\")","v":""},null,null,null,null,null,null,{"$f":"IF(INSERIMENTO!$J$21>0,AK6,\"\")","v":""},null,null,null,null,null,null,{"$f":"IF(INSERIMENTO!$J$23>0,AR6,\"\")","v":""},null,null,null,null,null,null,{"$f":"IF(INSERIMENTO!$J$25>0,AY6,\"\")","v":""}]
[null,{"$f":"CONCATENATE(H7,\" \",E7)","v":"A1F1 35612"},"A1F1 (A1) 35612",null,"1997-07-01","1999-12-31","A1","A1F1",107.42,112.58,115.17,{"$f":"ROUND(I7*12,2)","v":1289.04},null,null,1289.04,null,null,null,null,null,"CDC","CORTE DEI CONTI",null,null,null,null,null,"CDC",null,{"$f":"IF(INSERIMENTO!$J$17>0,V7,\"\")","v":"CORTE DEI CONTI"},null,null,null,null,null,null,{"$f":"IF(INSERIMENTO!$J$19>0,AD7,\"\")","v":""},null,null,null,null,null,null,{"$f":"IF(INSERIMENTO!$J$21>0,AK7,\"\")","v":""},null,null,null,null,null,null,{"$f":"IF(INSERIMENTO!$J$23>0,AR7,\"\")","v":""},null,null,null,null,null,null,{"$f":"IF(INSERIMENTO!$J$25>0,AY7,\"\")","v":""}]
[null,"A1F1 36526","A1F1 (A1) 36526",null,"2000-01-01","2000-06-30","A1","A1F1",114.65,119.81,122.4,1375.8,null,null,1375.8,null,null,null,null,null,"CUL","CULTURA",null,null,null,null,null,"CUL",null,{"$f":"IF(INSERIMENTO!$J$17>0,V8,\"\")","v":"CULTURA"},null,null,null,null,null,null,{"$f":"IF(INSERIMENTO!$J$19>0,AD8,\"\")","v":""},null,null,null,null,null,null,{"$f":"IF(INSERIMENTO!$J$21>0,AK8,\"\")","v":""},null,null,null,null,null,null,{"$f":"IF(INSERIMENTO!$J$23>0,AR8,\"\")","v":""},null,null,null,null,null,null,{"$f":"IF(INSERIMENTO!$J$25>0,AY8,\"\")","v":""}]
[null,"A1F1 36708","A1F1 (A1) 36708",null,"2000-07-01","2000-12-31","A1","A1F1",119.30000000000001,124.46000000000001,127.05000000000001,1431.6,null,null,1431.6,null,null,null,null,null,"DEM","DEMANIO - AGENZIA",null,null,null,null,null,"DEM",null,{"$f":"IF(INSERIMENTO!$J$17>0,V9,\"\")","v":"DEMANIO - AGENZIA"},null,null,null,null,null,null,{"$f":"IF(INSERIMENTO!$J$19>0,AD9,\"\")","v":""},null,null,null,null,null,null,{"$f":"IF(INSERIMENTO!$J$21>0,AK9,\"\")","v":""},null,null,null,null,null,null,{"$f":"IF(INSERIMENTO!$J$23>0,AR9,\"\")","v":""},null,null,null,null,null,null,{"$f":"IF(INSERIMENTO!$J$25>0,AY9,\"\")","v":""}]
[null,"A1F1 36892","A1F1 (A1) 36892",null,"2001-01-01","2001-12-31","A1","A1F1",121.36,126.52,129.11000000000001,1456.32,null,null,1456.32,null,null,null,null,null,"DIG","DIGITALE ITALIA - AGENZIA",null,null,null,null,null,"DIG",null,{"$f":"IF(INSERIMENTO!$J$17>0,V10,\"\")","v":"DIGITALE ITALIA - AGENZIA"},null,null,null,null,null,null,{"$f":"IF(INSERIMENTO!$J$19>0,AD10,\"\")","v":""},null,null,null,null,null,null,{"$f":"IF(INSERIMENTO!$J$21>0,AK10,\"\")","v":""},null,null,null,null,null,null,{"$f":"IF(INSERIMENTO!$J$23>0,AR10,\"\")","v":""},null,null,null,null,null,null,{"$f":"IF(INSERIMENTO!$J$25>0,AY10,\"\")","v":""}]
[null,"A1F1 37257","A1F1 (A1) 37257",null,"2002-01-01","2002-12-31","A1","A1F1",131.96,137.12,139.71,1583.52,null,null,1583.52,"INCREMENTI ANNUI POST 31/12/2019",null,null,null,null,"DOG","DOGANE E MONOPOLI- AGENZIA",null,null,null,null,null,"DOG",null,{"$f":"IF(INSERIMENTO!$J$17>0,V11,\"\")","v":"DOGANE E MONOPOLI- AGENZIA"},null,null,null,null,null,null,{"$f":"IF(INSERIMENTO!$J$19>0,AD11,\"\")","v":""},null,null,null,null,null,null,{"$f":"IF(INSERIMENTO!$J$21>0,AK11,\"\")","v":""},null,null,null,null,null,null,{"$f":"IF(INSERIMENTO!$J$23>0,AR11,\"\")","v":""},null,null,null,null,null,null,{"$f":"IF(INSERIMENTO!$J$25>0,AY11,\"\")","v":""}]
[null,"A1F1 37622","A1F1 (A1) 37622",null,"2003-01-01","2007-12-30","A1","A1F1",132.57,137.72999999999999,140.31,1590.84,null,null,1590.84,"DPCM 23.12.2021",null,null,"CCNL 2019 -2021",null,"MEF","ECONOMIA E FINANZE",null,null,null,null,null,"MEF",null,{"$f":"IF(INSERIMENTO!$J$17>0,V12,\"\")","v":"ECONOMIA E FINANZE"},null,null,null,null,null,null,{"$f":"IF(INSERIMENTO!$J$19>0,AD12,\"\")","v":""},null,null,null,null,null,null,{"$f":"IF(INSERIMENTO!$J$21>0,AK12,\"\")","v":""},null,null,null,null,null,null,{"$f":"IF(INSERIMENTO!$J$23>0,AR12,\"\")","v":""},null,null,null,null,null,null,{"$f":"IF(INSERIMENTO!$J$25>0,AY12,\"\")","v":""}]
[null,"A1F1 39447","A1F1 (A1) 39447",null,"2007-12-31","2019-12-31","A1","A1F1",152.85,152.85,152.85,1834.2,null,null,1834.2,"dal 2020","dal 2021",null,"dal 2021",null,"ENT","ENTRATE - AGENZIA",null,null,null,null,null,"ENT",null,{"$f":"IF(INSERIMENTO!$J$17>0,V13,\"\")","v":"ENTRATE - AGENZIA"},null,null,null,null,null,null,{"$f":"IF(INSERIMENTO!$J$19>0,AD13,\"\")","v":""},null,null,null,null,null,null,{"$f":"IF(INSERIMENTO!$J$21>0,AK13,\"\")","v":""},null,null,null,null,null,null,{"$f":"IF(INSERIMENTO!$J$23>0,AR13,\"\")","v":""},null,null,null,null,null,null,{"$f":"IF(INSERIMENTO!$J$25>0,AY13,\"\")","v":""}]
[null,"A1F1 43831","A1F1 (A1) 43831",null,"2020-01-01","2020-12-31","A1","A1F1",{"$f":"ROUND(L14/12,2)","v":228.1},{"$f":"I14","v":228.1},{"$f":"J14","v":228.1},{"$f":"HLOOKUP(H14,'CCNL 2019-2021'!$M$73:$AB$75,'CCNL 2019-2021'!$J$74,FALSE)","v":2737.2},null,{"$f":"ROUND(O14/12,2)","v":228.1},{"$f":"O13+P14","v":2737.2},{"$f":"HLOOKUP(H14,$E$270:$T$277,8,FALSE)","v":903},{"$f":"HLOOKUP(H14,$E$291:$T$298,8,FALSE)","v":881},null,null,null,"GIU","GIUSTIZIA",null,null,null,null,null,"GIU",null,{"$f":"IF(INSERIMENTO!$J$17>0,V14,\"\")","v":"GIUSTIZIA"},null,null,null,null,null,null,{"$f":"IF(INSERIMENTO!$J$19>0,AD14,\"\")","v":""},null,null,null,null,null,null,{"$f":"IF(INSERIMENTO!$J$21>0,AK14,\"\")","v":""},null,null,null,null,null,null,{"$f":"IF(INSERIMENTO!$J$23>0,AR14,\"\")","v":""},null,null,null,null,null,null,{"$f":"IF(INSERIMENTO!$J$25>0,AY14,\"\")","v":""}]
[null,"A1F1 44197","A1F1 (A1) 44197",null,"2021-01-01","2022-10-31","A1","A1F1",{"$f":"ROUND(L15/12,2)","v":279.95},{"$f":"I15","v":279.95},279.95,{"$f":"HLOOKUP(H15,'CCNL 2019-2021'!$M$73:$AB$75,'CCNL 2019-2021'!$J$75,FALSE)","v":3359.3999999999996},null,{"$f":"ROUND(O15/12,2)","v":279.95},{"$f":"O13+Q14+S15","v":3359.3599999999997},null,null,null,{"$f":"ROUND(VLOOKUP(H15,$V$291:$W$306,2,FALSE)*12,2)","v":644.16},null,"TRA","INFRASTRUTTURE E MOBILITA' SOSTENIBILE",null,null,null,null,null,"TRA",null,{"$f":"IF(INSERIMENTO!$J$17>0,V15,\"\")","v":"INFRASTRUTTURE E MOBILITA' SOSTENIBILE"},null,null,null,null,null,null,{"$f":"IF(INSERIMENTO!$J$19>0,AD15,\"\")","v":""},null,null,null,null,null,null,{"$f":"IF(INSERIMENTO!$J$21>0,AK15,\"\")","v":""},null,null,null,null,null,null,{"$f":"IF(INSERIMENTO!$J$23>0,AR15,\"\")","v":""},null,null,null,null,null,null,{"$f":"IF(INSERIMENTO!$J$25>0,AY15,\"\")","v":""}]
[null,{"$f":"CONCATENATE(H16,\" \",E16)","v":"A1F1 44866"},{"$f":"CONCATENATE(H16,\" (\",G16,\") \",E16)","v":"A1F1 (A1) 44866"},null,"2022-11-01","9999-01-01",{"$f":"G15","v":"A1"},{"$f":"H15","v":"A1F1"},{"$f":"ROUND(L16/12,2)","v":253.36},{"$f":"I16","v":253.36},{"$f":"J16","v":253.36},{"$f":"VLOOKUP(H16,'CCNL 2019-2021'!$H$79:$I$94,2,FALSE)","v":3040.32},null,null,null,null,null,null,null,null,"INT","INTERNO",null,null,null,null,null,"INT",null,{"$f":"IF(INSERIMENTO!$J$17>0,V16,\"\")","v":"INTERNO"},null,null,null,null,null,null,{"$f":"IF(INSERIMENTO!$J$19>0,AD16,\"\")","v":""},null,null,null,null,null,null,{"$f":"IF(INSERIMENTO!$J$21>0,AK16,\"\")","v":""},null,null,null,null,null,null,{"$f":"IF(INSERIMENTO!$J$23>0,AR16,\"\")","v":""},null,null,null,null,null,null,{"$f":"IF(INSERIMENTO!$J$25>0,AY16,\"\")","v":""}]
[null,null,null,null,"A1S","A1F2",null,null,null,null,null,null,null,null,null,null,null,null,null,null,"IST","ISTRUZIONE",null,null,null,null,null,"IST",null,{"$f":"IF(INSERIMENTO!$J$17>0,V17,\"\")","v":"ISTRUZIONE"},null,null,null,null,null,null,{"$f":"IF(INSERIMENTO!$J$19>0,AD17,\"\")","v":""},null,null,null,null,null,null,{"$f":"IF(INSERIMENTO!$J$21>0,AK17,\"\")","v":""},null,null,null,null,null,null,{"$f":"IF(INSERIMENTO!$J$23>0,AR17,\"\")","v":""},null,null,null,null,null,null,{"$f":"IF(INSERIMENTO!$J$25>0,AY17,\"\")","v":""}]
[null,"A1F2 34700",{"$f":"CONCATENATE(H18,\" (\",G18,\") \",E18)","v":"A1F2 (A1S) 34700"},null,"1995-01-01","1997-06-30","A1S","A1F2",83.15,88.31,90.9,{"$f":"ROUND(I18*12,2)","v":997.8},null,null,{"$f":"ROUND(I18*12,2)","v":997.8},null,null,null,null,null,"LAV","LAVORO E POLITICHE SOCIALI",null,null,null,null,null,"LAV",null,{"$f":"IF(INSERIMENTO!$J$17>0,V18,\"\")","v":"LAVORO E POLITICHE SOCIALI"},null,null,null,null,null,null,{"$f":"IF(INSERIMENTO!$J$19>0,AD18,\"\")","v":""},null,null,null,null,null,null,{"$f":"IF(INSERIMENTO!$J$21>0,AK18,\"\")","v":""},null,null,null,null,null,null,{"$f":"IF(INSERIMENTO!$J$23>0,AR18,\"\")","v":""},null,null,null,null,null,null,{"$f":"IF(INSERIMENTO!$J$25>0,AY18,\"\")","v":""}]
[null,"A1F2 35612","A1F2 (A1S) 35612",null,"1997-07-01","1999-12-31","A1S","A1F2",107.42,112.58,115.17,1289.04,null,null,1289.04,null,null,null,null,null,"AGR","POLITICHE AGRICOLE, ALIMENTARI E FORESTALI",null,null,null,null,null,"AGR",null,{"$f":"IF(INSERIMENTO!$J$17>0,V19,\"\")","v":"POLITICHE AGRICOLE, ALIMENTARI E FORESTALI"},null,null,null,null,null,null,{"$f":"IF(INSERIMENTO!$J$19>0,AD19,\"\")","v":""},null,null,null,null,null,null,{"$f":"IF(INSERIMENTO!$J$21>0,AK19,\"\")","v":""},null,null,null,null,null,null,{"$f":"IF(INSERIMENTO!$J$23>0,AR19,\"\")","v":""},null,null,null,null,null,null,{"$f":"IF(INSERIMENTO!$J$25>0,AY19,\"\")","v":""}]
[null,"A1F2 36526","A1F2 (A1S) 36526",null,"2000-01-01","2000-06-30","A1S","A1F2",114.65,119.81,122.4,1375.8,null,null,1375.8,null,null,null,null,null,"PCM","PRESIDENZA CONSIGLIO MINISTRI",null,null,null,null,null,"PCM",null,{"$f":"IF(INSERIMENTO!$J$17>0,V20,\"\")","v":"PRESIDENZA CONSIGLIO MINISTRI"},null,null,null,null,null,null,{"$f":"IF(INSERIMENTO!$J$19>0,AD20,\"\")","v":""},null,null,null,null,null,null,{"$f":"IF(INSERIMENTO!$J$21>0,AK20,\"\")","v":""},null,null,null,null,null,null,{"$f":"IF(INSERIMENTO!$J$23>0,AR20,\"\")","v":""},null,null,null,null,null,null,{"$f":"IF(INSERIMENTO!$J$25>0,AY20,\"\")","v":""}]
[null,"A1F2 36708","A1F2 (A1S) 36708",null,"2000-07-01","2000-12-31","A1S","A1F2",119.30000000000001,124.46000000000001,127.05000000000001,1431.6,null,null,1431.6,null,null,null,null,null,"SAL","SALUTE",null,null,null,null,null,"SAL",null,{"$f":"IF(INSERIMENTO!$J$17>0,V21,\"\")","v":"SALUTE"},null,null,null,null,null,null,{"$f":"IF(INSERIMENTO!$J$19>0,AD21,\"\")","v":""},null,null,null,null,null,null,{"$f":"IF(INSERIMENTO!$J$21>0,AK21,\"\")","v":""},null,null,null,null,null,null,{"$f":"IF(INSERIMENTO!$J$23>0,AR21,\"\")","v":""},null,null,null,null,null,null,{"$f":"IF(INSERIMENTO!$J$25>0,AY21,\"\")","v":""}]
[null,"A1F2 36892","A1F2 (A1S) 36892",null,"2001-01-01","2001-12-31","A1S","A1F2",121.36,126.52,129.11000000000001,1456.32,null,null,1456.32,null,null,null,null,null,"SVI","SVILUPPO ECONOMICO",null,null,null,null,null,"SVI",null,{"$f":"IF(INSERIMENTO!$J$17>0,V22,\"\")","v":"SVILUPPO ECONOMICO"},null,null,null,null,null,null,{"$f":"IF(INSERIMENTO!$J$19>0,AD22,\"\")","v":""},null,null,null,null,null,null,{"$f":"IF(INSERIMENTO!$J$21>0,AK22,\"\")","v":""},null,null,null,null,null,null,{"$f":"IF(INSERIMENTO!$J$23>0,AR22,\"\")","v":""},null,null,null,null,null,null,{"$f":"IF(INSERIMENTO!$J$25>0,AY22,\"\")","v":""}]
[null,"A1F2 37257","A1F2 (A1S) 37257",null,"2002-01-01","2002-12-31","A1S","A1F2",131.96,137.12,139.71,1583.52,null,null,1583.52,"INCREMENTI ANNUI POST 31/12/2019",null,null,null,null,"TAR","TAR",null,null,null,null,null,"TAR",null,{"$f":"IF(INSERIMENTO!$J$17>0,V23,\"\")","v":"TAR"},null,null,null,null,null,null,{"$f":"IF(INSERIMENTO!$J$19>0,AD23,\"\")","v":""},null,null,null,null,null,null,{"$f":"IF(INSERIMENTO!$J$21>0,AK23,\"\")","v":""},null,null,null,null,null,null,{"$f":"IF(INSERIMENTO!$J$23>0,AR23,\"\")","v":""},null,null,null,null,null,null,{"$f":"IF(INSERIMENTO!$J$25>0,AY23,\"\")","v":""}]
[null,"A1F2 37622","A1F2 (A1S) 37622",null,"2003-01-01","2007-12-30","A1S","A1F2",132.57,137.72999999999999,140.31,1590.84,null,null,1590.84,"DPCM 23.12.2021",null,null,"CCNL 2019 -2021",null,"AMB","TRANSIZIONE ECOLOGICA",null,null,null,null,null,"AMB",null,{"$f":"IF(INSERIMENTO!$J$17>0,V24,\"\")","v":"TRANSIZIONE ECOLOGICA"},null,null,null,null,null,null,{"$f":"IF(INSERIMENTO!$J$19>0,AD24,\"\")","v":""},null,null,null,null,null,null,{"$f":"IF(INSERIMENTO!$J$21>0,AK24,\"\")","v":""},null,null,null,null,null,null,{"$f":"IF(INSERIMENTO!$J$23>0,AR24,\"\")","v":""},null,null,null,null,null,null,{"$f":"IF(INSERIMENTO!$J$25>0,AY24,\"\")","v":""}]
[null,"A1F2 39447","A1F2 (A1S) 39447",null,"2007-12-31","2019-12-31","A1S","A1F2",152.85,152.85,152.85,1834.2,null,null,1834.2,"dal 2020","dal 2021",null,"dal 2021",null,"TUR","TURISMO",null,null,null,null,null,"TUR",null,{"$f":"IF(INSERIMENTO!$J$17>0,V25,\"\")","v":"TURISMO"},null,null,null,null,null,null,{"$f":"IF(INSERIMENTO!$J$19>0,AD25,\"\")","v":""},null,null,null,null,null,null,{"$f":"IF(INSERIMENTO!$J$21>0,AK25,\"\")","v":""},null,null,null,null,null,null,{"$f":"IF(INSERIMENTO!$J$23>0,AR25,\"\")","v":""},null,null,null,null,null,null,{"$f":"IF(INSERIMENTO!$J$25>0,AY25,\"\")","v":""}]
[null,"A1F2 43831","A1F2 (A1S) 43831",null,"2020-01-01","2020-12-31","A1S","A1F2",{"$f":"ROUND(L26/12,2)","v":228.1},{"$f":"I26","v":228.1},{"$f":"J26","v":228.1},{"$f":"HLOOKUP(H26,'CCNL 2019-2021'!$M$73:$AB$75,'CCNL 2019-2021'!$J$74,FALSE)","v":2737.2},null,{"$f":"ROUND(O26/12,2)","v":228.1},{"$f":"O25+P26","v":2737.2},{"$f":"HLOOKUP(H26,$E$270:$T$277,8,FALSE)","v":903},{"$f":"HLOOKUP(H26,$E$291:$T$298,8,FALSE)","v":881},null,null,null,"URI","UNIVERSITÀ E RICERCA",null,null,null,null,null,"URI",null,{"$f":"IF(INSERIMENTO!$J$17>0,V26,\"\")","v":"UNIVERSITÀ E RICERCA"},null,null,null,null,null,null,{"$f":"IF(INSERIMENTO!$J$19>0,AD26,\"\")","v":""},null,null,null,null,null,null,{"$f":"IF(INSERIMENTO!$J$21>0,AK26,\"\")","v":""},null,null,null,null,null,null,{"$f":"IF(INSERIMENTO!$J$23>0,AR26,\"\")","v":""},null,null,null,null,null,null,{"$f":"IF(INSERIMENTO!$J$25>0,AY26,\"\")","v":""}]
[null,"A1F2 44197","A1F2 (A1S) 44197",null,"2021-01-01","2022-10-31","A1S","A1F2",{"$f":"ROUND(L27/12,2)","v":279.95},{"$f":"I27","v":279.95},{"$f":"J27","v":279.95},{"$f":"HLOOKUP(H27,'CCNL 2019-2021'!$M$73:$AB$75,'CCNL 2019-2021'!$J$75,FALSE)","v":3359.3999999999996},null,{"$f":"ROUND(O27/12,2)","v":279.95},{"$f":"O25+Q26+S27","v":3359.3599999999997},null,null,null,{"$f":"ROUND(VLOOKUP(H27,$V$291:$W$306,2,FALSE)*12,2)","v":644.16}]
[null,{"$f":"CONCATENATE(H28,\" \",E28)","v":"A1F2 44866"},{"$f":"CONCATENATE(H28,\" (\",G28,\") \",E28)","v":"A1F2 (A1S) 44866"},null,"2022-11-01","9999-01-01",{"$f":"G27","v":"A1S"},{"$f":"H27","v":"A1F2"},{"$f":"ROUND(L28/12,2)","v":253.36},{"$f":"I28","v":253.36},{"$f":"J28","v":253.36},{"$f":"VLOOKUP(H28,'CCNL 2019-2021'!$H$79:$I$94,2,FALSE)","v":3040.32}]
[null,null,null,null,"--------","A1F3",null,null,null,null,null,null,null,null,null,"INCREMENTI ANNUI POST 31/12/2019"]
[null,"A1F3 34700",{"$f":"CONCATENATE($F$29,\" \",E30)","v":"A1F3 34700"},null,"1995-01-01","2007-12-30","--------","A1F3",132.57,137.72999999999999,0,{"$f":"ROUND(I30*12,2)","v":1590.84},null,null,{"$f":"ROUND(I30*12,2)","v":1590.84},"DPCM 23.12.2021",null,null,"CCNL 2019 -2021",null,"ICE","COMMERCIO ESTERO (EX)",null,null,null,null,null,"ICE"]
[null,"A1F3 39447",{"$f":"CONCATENATE($F$29,\" \",E31)","v":"A1F3 39447"},null,"2007-12-31","2019-12-31","--------","A1F3",152.85,152.85,152.85,1834.2,null,null,{"$f":"ROUND(I31*12,2)","v":1834.2},"dal 2020","dal 2021",null,"dal 2021",null,"COM","COMUNICAZIONI (EX)",null,null,null,null,null,"COM"]
[null,"A1F3 43831","A1F3 43831",null,"2020-01-01","2020-12-31","--------","A1F3",{"$f":"ROUND(L32/12,2)","v":228.1},{"$f":"I32","v":228.1},{"$f":"J32","v":228.1},{"$f":"HLOOKUP(H32,'CCNL 2019-2021'!$M$73:$AB$75,'CCNL 2019-2021'!$J$74,FALSE)","v":2737.2},null,{"$f":"ROUND(O32/12,2)","v":228.1},{"$f":"O31+P32","v":2737.2},{"$f":"HLOOKUP(H32,$E$270:$T$277,8,FALSE)","v":903},{"$f":"HLOOKUP(H32,$E$291:$T$298,8,FALSE)","v":881},null,null,null,"IND","INDUSTRIA (EX)",null,null,null,null,null,"IND"]
[null,"A1F3 44197","A1F3 44197",null,"2021-01-01","2022-10-31","--------","A1F3",{"$f":"ROUND(L33/12,2)","v":279.95},{"$f":"I33","v":279.95},{"$f":"J33","v":279.95},{"$f":"HLOOKUP(H33,'CCNL 2019-2021'!$M$73:$AB$75,'CCNL 2019-2021'!$J$75,FALSE)","v":3359.3999999999996},null,{"$f":"ROUND(O33/12,2)","v":279.95},{"$f":"O31+Q32+S33","v":3359.3599999999997},null,null,null,{"$f":"ROUND(VLOOKUP(H33,$V$291:$W$306,2,FALSE)*12,2)","v":644.16},null,"PEN","PENITENZIARIA",null,null,null,null,null,"PEN"]
[null,"A1F3 44866",{"$f":"B34","v":"A1F3 44866"},null,"2022-11-01","9999-01-01",{"$f":"G33","v":"--------"},{"$f":"H33","v":"A1F3"},{"$f":"ROUND(L34/12,2)","v":253.36},{"$f":"I34","v":253.36},{"$f":"J34","v":253.36},{"$f":"VLOOKUP(H34,'CCNL 2019-2021'!$H$79:$I$94,2,FALSE)","v":3040.32}]
[null,null,null,null,"B1","A2F1",null,null,null,null,null,null,null,null," "]
[null,"A2F1 34700",{"$f":"CONCATENATE(H36,\" (\",G36,\") \",E36)","v":"A2F1 (B1) 34700"},null,"1995-01-01","1997-06-30","B1","A2F1",94.51,100.71,103.29,{"$f":"ROUND(I36*12,2)","v":1134.1199999999999},null,null,{"$f":"ROUND(I36*12,2)","v":1134.1199999999999}]
[null,"A2F1 35612","A2F1 (B1) 35612",null,"1997-07-01","1999-12-31","B1","A2F1",119.82000000000001,126.02,128.6,1437.84,null,null,1437.84]
[null,"A2F1 36526","A2F1 (B1) 36526",null,"2000-01-01","2000-06-30","B1","A2F1",127.57000000000001,133.76999999999998,136.35,1530.84,null,null,1530.84]
[null,"A2F1 36708","A2F1 (B1) 36708",null,"2000-07-01","2000-12-31","B1","A2F1",132.73000000000002,138.92999999999998,141.51,1592.76,null,null,1592.76]
[null,"A2F1 36892","A2F1 (B1) 36892",null,"2001-01-01","2001-12-31","B1","A2F1",135.32,141.51999999999998,144.1,1623.84,null,null,1623.84]
[null,"A2F1 37257","A2F1 (B1) 37257",null,"2002-01-01","2002-12-31","B1","A2F1",147.12,153.32,155.9,1765.44,null,null,1765.44,"INCREMENTI ANNUI POST 31/12/2019"]
[null,"A2F1 37622","A2F1 (B1) 37622",null,"2003-01-01","2007-12-30","B1","A2F1",147.71,153.91,156.49,1772.52,null,null,1772.52,"DPCM 23.12.2021",null,null,"CCNL 2019 -2021"]
[null,"A2F1 39447","A2F1 (B1) 39447",null,"2007-12-31","2019-12-31","B1","A2F1",170.48,170.48,170.48,2045.76,null,null,2045.76,"dal 2020","dal 2021",null,"dal 2021"]
[null,"A2F1 43831","A2F1 (B1) 43831",null,"2020-01-01","2020-12-31","B1","A2F1",{"$f":"ROUND(L44/12,2)","v":249.73},{"$f":"I44","v":249.73},{"$f":"J44","v":249.73},{"$f":"HLOOKUP(H44,'CCNL 2019-2021'!$M$73:$AB$75,'CCNL 2019-2021'!$J$74,FALSE)","v":2996.76},null,{"$f":"ROUND(O44/12,2)","v":249.73},{"$f":"O43+P44","v":2996.76},{"$f":"HLOOKUP(H44,$E$270:$T$277,8,FALSE)","v":951},{"$f":"HLOOKUP(H44,$E$291:$T$298,8,FALSE)","v":913}]
[null,"A2F1 44197","A2F1 (B1) 44197",null,"2021-01-01","2022-10-31","B1","A2F1",{"$f":"ROUND(L45/12,2)","v":318.75},{"$f":"I45","v":318.75},{"$f":"J45","v":318.75},{"$f":"HLOOKUP(H45,'CCNL 2019-2021'!$M$73:$AB$75,'CCNL 2019-2021'!$J$75,FALSE)","v":3825},null,{"$f":"ROUND(O45/12,2)","v":318.75},{"$f":"O43+Q44+S45","v":3825.04},null,null,null,{"$f":"ROUND(VLOOKUP(H45,$V$291:$W$306,2,FALSE)*12,2)","v":866.28}]
[null,"A2F1 44866","A2F1 (B1) 44866",null,"2022-11-01","9999-01-01",{"$f":"G45","v":"B1"},{"$f":"H45","v":"A2F1"},{"$f":"ROUND(L46/12,2)","v":291.67},{"$f":"I46","v":291.67},{"$f":"J46","v":291.67},{"$f":"VLOOKUP(H46,'CCNL 2019-2021'!$H$79:$I$94,2,FALSE)","v":3500.04}]
[null,null,null,null,"B2","A2F2"]
[null,"A2F2 34700",{"$f":"CONCATENATE(H48,\" (\",G48,\") \",E48)","v":"A2F2 (B2) 34700"},null,"1995-01-01","1997-06-30","B2","A2F2",104.32,111.04,114.14,{"$f":"ROUND(I48*12,2)","v":1251.8399999999999},null,null,{"$f":"ROUND(I48*12,2)","v":1251.8399999999999}]
[null,"A2F2 35612","A2F2 (B2) 35612",null,"1997-07-01","1999-12-31","B2","A2F2",131.18,137.9,141,1574.16,null,null,1574.16]
[null,"A2F2 36526","A2F2 (B2) 36526",null,"2000-01-01","2000-06-30","B2","A2F2",139.96,146.68,149.78,1679.52,null,null,1679.52]
[null,"A2F2 36708","A2F2 (B2) 36708",null,"2000-07-01","2000-12-31","B2","A2F2",145.64000000000001,152.36000000000001,155.46,1747.68,null,null,1747.68]
[null,"A2F2 36892","A2F2 (B2) 36892",null,"2001-01-01","2001-12-31","B2","A2F2",148.22,154.94,158.04,1778.64,null,null,1778.64]
[null,"A2F2 37257","A2F2 (B2) 37257",null,"2002-01-01","2002-12-31","B2","A2F2",161.41999999999999,168.14,171.23999999999998,1937.04,null,null,1937.04,"INCREMENTI ANNUI POST 31/12/2019"]
[null,"A2F2 37622","A2F2 (B2) 37622",null,"2003-01-01","2007-12-30","B2","A2F2",162.02000000000001,168.74,171.84,1944.24,null,null,1944.24,"DPCM 23.12.2021",null,null,"CCNL 2019 -2021"]
[null,"A2F2 39447","A2F2 (B2) 39447",null,"2007-12-31","2019-12-31","B2","A2F2",187.2,187.2,187.2,2246.4,null,null,2246.4,"dal 2020","dal 2021",null,"dal 2021"]
[null,"A2F2 43831","A2F2 (B2) 43831",null,"2020-01-01","2020-12-31","B2","A2F2",{"$f":"ROUND(L56/12,2)","v":266.27999999999997},{"$f":"I56","v":266.27999999999997},{"$f":"J56","v":266.27999999999997},{"$f":"HLOOKUP(H56,'CCNL 2019-2021'!$M$73:$AB$75,'CCNL 2019-2021'!$J$74,FALSE)","v":3195.36},null,{"$f":"ROUND(O56/12,2)","v":266.27999999999997},{"$f":"O55+P56","v":3195.4},{"$f":"HLOOKUP(H56,$E$270:$T$277,8,FALSE)","v":949},{"$f":"HLOOKUP(H56,$E$291:$T$298,8,FALSE)","v":887}]
[null,"A2F2 44197","A2F2 (B2) 44197",null,"2021-01-01","2022-10-31","B2","A2F2",{"$f":"ROUND(L57/12,2)","v":333.31},{"$f":"I57","v":333.31},{"$f":"J57","v":333.31},{"$f":"HLOOKUP(H57,'CCNL 2019-2021'!$M$73:$AB$75,'CCNL 2019-2021'!$J$75,FALSE)","v":3999.7200000000003},null,{"$f":"ROUND(O57/12,2)","v":333.31},{"$f":"O55+Q56+S57","v":3999.6800000000003},null,null,null,{"$f":"ROUND(VLOOKUP(H57,$V$291:$W$306,2,FALSE)*12,2)","v":866.28}]
[null,"A2F2 44866","A2F2 (B2) 44866",null,"2022-11-01","9999-01-01",{"$f":"G57","v":"B2"},{"$f":"H57","v":"A2F2"},{"$f":"ROUND(L58/12,2)","v":291.67},{"$f":"I58","v":291.67},{"$f":"J58","v":291.67},{"$f":"VLOOKUP(H58,'CCNL 2019-2021'!$H$79:$I$94,2,FALSE)","v":3500.04}]
[null,null,null,null,"B3","A2F3",null,null,null,null,null,null,null,null," "]
[null,"A2F3 34700",{"$f":"CONCATENATE(H60,\" (\",G60,\") \",E60)","v":"A2F3 (B3) 34700"},null,"1995-01-01","1997-06-30","B3","A2F3",117.24,123.95,127.56,{"$f":"ROUND(I60*12,2)","v":1406.88},null,null,{"$f":"ROUND(I60*12,2)","v":1406.88}]
[null,"A2F3 35612","A2F3 (B3) 35612",null,"1997-07-01","1999-12-31","B3","A2F3",145.65,152.36000000000001,155.97,1747.8,null,null,1747.8]
[null,"A2F3 36526","A2F3 (B3) 36526",null,"2000-01-01","2000-06-30","B3","A2F3",154.95000000000002,161.66000000000003,165.27,1859.4,null,null,1859.4]
[null,"A2F3 36708","A2F3 (B3) 36708",null,"2000-07-01","2000-12-31","B3","A2F3",161.66000000000003,168.37000000000003,171.98000000000002,1939.92,null,null,1939.92]
[null,"A2F3 36892","A2F3 (B3) 36892",null,"2001-01-01","2001-12-31","B3","A2F3",164.25000000000003,170.96000000000004,174.57000000000002,1971,null,null,1971]
[null,"A2F3 37257","A2F3 (B3) 37257",null,"2002-01-01","2002-12-31","B3","A2F3",178.85000000000002,185.56000000000003,189.17000000000002,2146.1999999999998,null,null,2146.1999999999998,"INCREMENTI ANNUI POST 31/12/2019"]
[null,"A2F3 37622","A2F3 (B3) 37622",null,"2003-01-01","2007-12-30","B3","A2F3",179.63000000000002,186.35000000000005,189.96000000000004,2155.56,null,null,2155.56,"DPCM 23.12.2021",null,null,"CCNL 2019 -2021"]
[null,"A2F3 39447","A2F3 (B3) 39447",null,"2007-12-31","2019-12-31","B3","A2F3",206.94,206.94,206.94,2483.2800000000002,null,null,2483.2800000000002,"dal 2020","dal 2021",null,"dal 2021"]
[null,"A2F3 43831","A2F3 (B3) 43831",null,"2020-01-01","2020-12-31","B3","A2F3",{"$f":"ROUND(L68/12,2)","v":290.52},{"$f":"I68","v":290.52},{"$f":"J68","v":290.52},{"$f":"HLOOKUP(H68,'CCNL 2019-2021'!$M$73:$AB$75,'CCNL 2019-2021'!$J$74,FALSE)","v":3486.24},null,{"$f":"ROUND(O68/12,2)","v":290.52},{"$f":"O67+P68","v":3486.28},{"$f":"HLOOKUP(H68,$E$270:$T$277,8,FALSE)","v":1003},{"$f":"HLOOKUP(H68,$E$291:$T$298,8,FALSE)","v":924}]
[null,"A2F3 44197","A2F3 (B3) 44197",null,"2021-01-01","2022-10-31","B3","A2F3",{"$f":"ROUND(L69/12,2)","v":356.13},{"$f":"I69","v":356.13},{"$f":"J69","v":356.13},{"$f":"HLOOKUP(H69,'CCNL 2019-2021'!$M$73:$AB$75,'CCNL 2019-2021'!$J$75,FALSE)","v":4273.5600000000004},null,{"$f":"ROUND(O69/12,2)","v":356.13},{"$f":"O67+Q68+S69","v":4273.5600000000004},null,null,null,{"$f":"ROUND(VLOOKUP(H69,$V$291:$W$306,2,FALSE)*12,2)","v":866.28}]
[null,"A2F3 44866","A2F3 (B3) 44866",null,"2022-11-01","9999-01-01",{"$f":"G69","v":"B3"},{"$f":"H69","v":"A2F3"},{"$f":"ROUND(L70/12,2)","v":291.67},{"$f":"I70","v":291.67},{"$f":"J70","v":291.67},{"$f":"VLOOKUP(H70,'CCNL 2019-2021'!$H$79:$I$94,2,FALSE)","v":3500.04}]
[null,null,null,null,"B3S","A2F4"]
[null,"A2F4 34700",{"$f":"CONCATENATE(H72,\" (\",G72,\") \",E72)","v":"A2F4 (B3S) 34700"},null,"1995-01-01","1997-06-30","B3S","A2F4",117.24,123.95,127.56,{"$f":"ROUND(I72*12,2)","v":1406.88},null,null,{"$f":"ROUND(I72*12,2)","v":1406.88}]
[null,"A2F4 35612","A2F4 (B3S) 35612",null,"1997-07-01","1999-12-31","B3S","A2F4",145.65,152.36000000000001,155.97,1747.8,null,null,1747.8]
[null,"A2F4 36526","A2F4 (B3S) 36526",null,"2000-01-01","2000-06-30","B3S","A2F4",154.95000000000002,161.66000000000003,165.27,1859.4,null,null,1859.4]
[null,"A2F4 36708","A2F4 (B3S) 36708",null,"2000-07-01","2000-12-31","B3S","A2F4",161.66000000000003,168.37000000000003,171.98000000000002,1939.92,null,null,1939.92]
[null,"A2F4 36892","A2F4 (B3S) 36892",null,"2001-01-01","2001-12-31","B3S","A2F4",164.25000000000003,170.96000000000004,174.57000000000002,1971,null,null,1971]
[null,{"$f":"CONCATENATE(H77,\" \",E77)","v":"A2F4 37257"},"A2F4 (B3S) 37257",null,"2002-01-01","2002-12-31","B3S","A2F4",178.85000000000002,185.56000000000003,189.17000000000002,2146.1999999999998,null,null,2146.1999999999998,"INCREMENTI ANNUI POST 31/12/2019"]
[null,"A2F4 37622","A2F4 (B3S) 37622",null,"2003-01-01","2007-12-30","B3S","A2F4",179.63000000000002,186.35000000000005,189.96000000000004,2155.56,null,null,2155.56,"DPCM 23.12.2021",null,null,"CCNL 2019 -2021"]
[null,"A2F4 39447","A2F4 (B3S) 39447",null,"2007-12-31","2019-12-31","B3S","A2F4",206.94,206.94,206.94,2483.2800000000002,null,null,2483.2800000000002,"dal 2020","dal 2021",null,"dal 2021"]
[null,"A2F4 43831","A2F4 (B3S) 43831",null,"2020-01-01","2020-12-31","B3S","A2F4",{"$f":"ROUND(L80/12,2)","v":290.52},{"$f":"I80","v":290.52},{"$f":"J80","v":290.52},{"$f":"HLOOKUP(H80,'CCNL 2019-2021'!$M$73:$AB$75,'CCNL 2019-2021'!$J$74,FALSE)","v":3486.24},null,{"$f":"ROUND(O80/12,2)","v":290.52},{"$f":"O79+P80","v":3486.28},{"$f":"HLOOKUP(H80,$E$270:$T$277,8,FALSE)","v":1003},{"$f":"HLOOKUP(H80,$E$291:$T$298,8,FALSE)","v":924}]
[null,"A2F4 44197","A2F4 (B3S) 44197",null,"2021-01-01","2022-10-31","B3S","A2F4",{"$f":"ROUND(L81/12,2)","v":356.13},{"$f":"I81","v":356.13},{"$f":"J81","v":356.13},{"$f":"HLOOKUP(H81,'CCNL 2019-2021'!$M$73:$AB$75,'CCNL 2019-2021'!$J$75,FALSE)","v":4273.5600000000004},null,{"$f":"ROUND(O81/12,2)","v":356.13},{"$f":"O79+Q80+S81","v":4273.5600000000004},null,null,null,{"$f":"ROUND(VLOOKUP(H81,$V$291:$W$306,2,FALSE)*12,2)","v":866.28}]
[null,"A2F4 44866","A2F4 (B3S) 44866",null,"2022-11-01","9999-01-01",{"$f":"G81","v":"B3S"},{"$f":"H81","v":"A2F4"},{"$f":"ROUND(L82/12,2)","v":291.67},{"$f":"I82","v":291.67},{"$f":"J82","v":291.67},{"$f":"VLOOKUP(H82,'CCNL 2019-2021'!$H$79:$I$94,2,FALSE)","v":3500.04}]
[null,null,null,null,"--------","A2F5",null,null,null,null,null,null,null,null,null,"INCREMENTI ANNUI POST 31/12/2019"]
[null,"A2F5 34700",{"$f":"CONCATENATE($F$83,\" \",E84)","v":"A2F5 34700"},null,"1995-01-01","2007-12-30","--------","A2F5",179.63000000000002,186.35000000000005,0,{"$f":"ROUND(I84*12,2)","v":2155.56},null,null,{"$f":"ROUND(I84*12,2)","v":2155.56},"DPCM 23.12.2021",null,null,"CCNL 2019 -2021"]
[null,"A2F5 39447",{"$f":"CONCATENATE($F$83,\" \",E85)","v":"A2F5 39447"},null,"2007-12-31","2019-12-31","--------","A2F5",206.94,206.94,206.94,2483.2800000000002,null,null,{"$f":"ROUND(I85*12,2)","v":2483.2800000000002},"dal 2020","dal 2021",null,"dal 2021"]
[null,"A2F5 43831","A2F5 43831",null,"2020-01-01","2020-12-31","--------","A2F5",{"$f":"ROUND(L86/12,2)","v":290.52},{"$f":"I86","v":290.52},{"$f":"J86","v":290.52},{"$f":"HLOOKUP(H86,'CCNL 2019-2021'!$M$73:$AB$75,'CCNL 2019-2021'!$J$74,FALSE)","v":3486.24},null,{"$f":"ROUND(O86/12,2)","v":290.52},{"$f":"O85+P86","v":3486.28},{"$f":"HLOOKUP(H86,$E$270:$T$277,8,FALSE)","v":1003},{"$f":"HLOOKUP(H86,$E$291:$T$298,8,FALSE)","v":924}]
[null,"A2F5 44197","A2F5 44197",null,"2021-01-01","2022-10-31","--------","A2F5",{"$f":"ROUND(L87/12,2)","v":356.13},{"$f":"I87","v":356.13},{"$f":"J87","v":356.13},{"$f":"HLOOKUP(H87,'CCNL 2019-2021'!$M$73:$AB$75,'CCNL 2019-2021'!$J$75,FALSE)","v":4273.5600000000004},null,{"$f":"ROUND(O87/12,2)","v":356.13},{"$f":"O85+Q86+S87","v":4273.5600000000004},null,null,null,{"$f":"ROUND(VLOOKUP(H87,$V$291:$W$306,2,FALSE)*12,2)","v":866.28}]
[null,"A2F5 44866",{"$f":"B88","v":"A2F5 44866"},null,"2022-11-01","9999-01-01",{"$f":"G87","v":"--------"},{"$f":"H87","v":"A2F5"},{"$f":"ROUND(L88/12,2)","v":291.67},291.67,291.67,{"$f":"VLOOKUP(H88,'CCNL 2019-2021'!$H$79:$I$94,2,FALSE)","v":3500.04}]
[null,null,null,null,"--------","A2F6",null,null,null,null,null,null,null,null,null,"INCREMENTI ANNUI POST 31/12/2019"]
[null,"A2F6 34700",{"$f":"CONCATENATE($F$89,\" \",E90)","v":"A2F6 34700"},null,"1995-01-01","2007-12-30","--------","A2F6",179.63000000000002,186.35000000000005,0,{"$f":"ROUND(I90*12,2)","v":2155.56},null,null,{"$f":"ROUND(I90*12,2)","v":2155.56},"DPCM 23.12.2021",null,null,"CCNL 2019 -2021"]
[null,"A2F6 39447",{"$f":"CONCATENATE($F$89,\" \",E91)","v":"A2F6 39447"},null,"2007-12-31","2019-12-31","--------","A2F6",206.94,206.94,206.94,2483.2800000000002,null,null,{"$f":"ROUND(I91*12,2)","v":2483.2800000000002},"dal 2020","dal 2021",null,"dal 2021"]
[null,"A2F6 43831","A2F6 43831",null,"2020-01-01","2020-12-31","--------","A2F6",{"$f":"ROUND(L92/12,2)","v":290.52},{"$f":"I92","v":290.52},{"$f":"J92","v":290.52},{"$f":"HLOOKUP(H92,'CCNL 2019-2021'!$M$73:$AB$75,'CCNL 2019-2021'!$J$74,FALSE)","v":3486.24},null,{"$f":"ROUND(O92/12,2)","v":290.52},{"$f":"O91+P92","v":3486.28},{"$f":"HLOOKUP(H92,$E$270:$T$277,8,FALSE)","v":1003},{"$f":"HLOOKUP(H92,$E$291:$T$298,8,FALSE)","v":924}]
[null,"A2F6 44197","A2F6 44197",null,"2021-01-01","2022-10-31","--------","A2F6",{"$f":"ROUND(L93/12,2)","v":356.13},{"$f":"I93","v":356.13},{"$f":"J93","v":356.13},{"$f":"HLOOKUP(H93,'CCNL 2019-2021'!$M$73:$AB$75,'CCNL 2019-2021'!$J$75,FALSE)","v":4273.5600000000004},null,{"$f":"ROUND(O93/12,2)","v":356.13},{"$f":"O91+Q92+S93","v":4273.5600000000004},null,null,null,{"$f":"ROUND(VLOOKUP(H93,$V$291:$W$306,2,FALSE)*12,2)","v":866.28}]
[null,"A2F6 44866",{"$f":"B94","v":"A2F6 44866"},null,"2022-11-01","9999-01-01",{"$f":"G93","v":"--------"},{"$f":"H93","v":"A2F6"},{"$f":"ROUND(L94/12,2)","v":291.67},{"$f":"I94","v":291.67},{"$f":"J94","v":291.67},{"$f":"VLOOKUP(H94,'CCNL 2019-2021'!$H$79:$I$94,2,FALSE)","v":3500.04}]
[null,null,null,null,"C1","A3F1"]
[null,"A3F1 34700",{"$f":"CONCATENATE(H96,\" (\",G96,\") \",E96)","v":"A3F1 (C1) 34700"},null,"1995-01-01","1997-06-30","C1","A3F1",131.18,138.93,142.54,{"$f":"ROUND(I96*12,2)","v":1574.16},null,null,{"$f":"ROUND(I96*12,2)","v":1574.16}]
[null,"A3F1 35612","A3F1 (C1) 35612",null,"1997-07-01","1999-12-31","C1","A3F1",162.17000000000002,169.92000000000002,173.53,1946.04,null,null,1946.04]
[null,"A3F1 36526","A3F1 (C1) 36526",null,"2000-01-01","2000-06-30","C1","A3F1",173.02,180.77,184.38,2076.2399999999998,null,null,2076.2399999999998]
[null,"A3F1 36708","A3F1 (C1) 36708",null,"2000-07-01","2000-12-31","C1","A3F1",180.25,188,191.60999999999999,2163,null,null,2163]
[null,"A3F1 36892","A3F1 (C1) 36892",null,"2001-01-01","2001-12-31","C1","A3F1",183.35000000000002,191.10000000000002,194.71,2200.1999999999998,null,null,2200.1999999999998]
[null,"A3F1 37257","A3F1 (C1) 37257",null,"2002-01-01","2002-12-31","C1","A3F1",199.95000000000002,207.70000000000002,211.31,2399.4,null,null,2399.4,"INCREMENTI ANNUI POST 31/12/2019"]
[null,"A3F1 37622","A3F1 (C1) 37622",null,"2003-01-01","2007-12-30","C1","A3F1",200.74000000000004,208.49000000000004,212.10000000000002,2408.88,null,null,2408.88,"DPCM 23.12.2021",null,null,"CCNL 2019 -2021"]
[null,"A3F1 39447","A3F1 (C1) 39447",null,"2007-12-31","2019-12-31","C1","A3F1",231.06,231.06,231.06,2772.72,null,null,2772.72,"dal 2020","dal 2021",null,"dal 2021"]
[null,"A3F1 43831","A3F1 (C1) 43831",null,"2020-01-01","2020-12-31","C1","A3F1",{"$f":"ROUND(L104/12,2)","v":337.31},{"$f":"I104","v":337.31},{"$f":"J104","v":337.31},{"$f":"HLOOKUP(H104,'CCNL 2019-2021'!$M$73:$AB$75,'CCNL 2019-2021'!$J$74,FALSE)","v":4047.72},null,{"$f":"ROUND(O104/12,2)","v":337.31},{"$f":"O103+P104","v":4047.72},{"$f":"HLOOKUP(H104,$E$270:$T$277,8,FALSE)","v":1275},{"$f":"HLOOKUP(H104,$E$291:$T$298,8,FALSE)","v":1221}]
[null,"A3F1 44197","A3F1 (C1) 44197",null,"2021-01-01","2022-10-31","C1","A3F1",{"$f":"ROUND(L105/12,2)","v":423.02},{"$f":"I105","v":423.02},{"$f":"J105","v":423.02},{"$f":"HLOOKUP(H105,'CCNL 2019-2021'!$M$73:$AB$75,'CCNL 2019-2021'!$J$75,FALSE)","v":5076.24},null,{"$f":"ROUND(O105/12,2)","v":423.02},{"$f":"O103+Q104+S105","v":5076.24},null,null,null,{"$f":"ROUND(VLOOKUP(H105,$V$291:$W$306,2,FALSE)*12,2)","v":1082.52}]
[null,"A3F1 44866","A3F1 (C1) 44866",null,"2022-11-01","9999-01-01",{"$f":"G105","v":"C1"},{"$f":"H105","v":"A3F1"},{"$f":"ROUND(L106/12,2)","v":386.5},{"$f":"I106","v":386.5},{"$f":"J106","v":386.5},{"$f":"VLOOKUP(H106,'CCNL 2019-2021'!$H$79:$I$94,2,FALSE)","v":4638}]
[null,null,null,null,"C1S","A3F2"]
[null,"A3F2 34700",{"$f":"CONCATENATE(H108,\" (\",G108,\") \",E108)","v":"A3F2 (C1S) 34700"},null,"1995-01-01","1997-06-30","C1S","A3F2",131.18,138.93,142.54,{"$f":"ROUND(I108*12,2)","v":1574.16},null,null,{"$f":"ROUND(I108*12,2)","v":1574.16}]
[null,"A3F2 35612","A3F2 (C1S) 35612",null,"1997-07-01","1999-12-31","C1S","A3F2",162.17000000000002,169.92000000000002,173.53,1946.04,null,null,1946.04]
[null,"A3F2 36526","A3F2 (C1S) 36526",null,"2000-01-01","2000-06-30","C1S","A3F2",173.02,180.77,184.38,2076.2399999999998,null,null,2076.2399999999998]
[null,"A3F2 36708","A3F2 (C1S) 36708",null,"2000-07-01","2000-12-31","C1S","A3F2",180.25,188,191.60999999999999,2163,null,null,2163,null,null,null,null,null,null,null,null,null,null,null,null,null,null,null,null,null,null,null," "]
[null,"A3F2 36892","A3F2 (C1S) 36892",null,"2001-01-01","2001-12-31","C1S","A3F2",183.35000000000002,191.10000000000002,194.71,2200.1999999999998,null,null,2200.1999999999998]
[null,"A3F2 37257","A3F2 (C1S) 37257",null,"2002-01-01","2002-12-31","C1S","A3F2",199.95000000000002,207.70000000000002,211.31,2399.4,null,null,2399.4,"INCREMENTI ANNUI POST 31/12/2019"]
[null,"A3F2 37622","A3F2 (C1S) 37622",null,"2003-01-01","2007-12-30","C1S","A3F2",200.74000000000004,208.49000000000004,212.10000000000002,2408.88,null,null,2408.88,"DPCM 23.12.2021",null,null,"CCNL 2019 -2021"]
[null,"A3F2 39447","A3F2 (C1S) 39447",null,"2007-12-31","2019-12-31","C1S","A3F2",231.06,231.06,231.06,2772.72,null,null,2772.72,"dal 2020","dal 2021",null,"dal 2021"]
[null,"A3F2 43831","A3F2 (C1S) 43831",null,"2020-01-01","2020-12-31","C1S","A3F2",{"$f":"ROUND(L116/12,2)","v":337.31},{"$f":"I116","v":337.31},{"$f":"J116","v":337.31},{"$f":"HLOOKUP(H116,'CCNL 2019-2021'!$M$73:$AB$75,'CCNL 2019-2021'!$J$74,FALSE)","v":4047.72},null,{"$f":"ROUND(O116/12,2)","v":337.31},{"$f":"O115+P116","v":4047.72},{"$f":"HLOOKUP(H116,$E$270:$T$277,8,FALSE)","v":1275},{"$f":"HLOOKUP(H116,$E$291:$T$298,8,FALSE)","v":1221}]
[null,"A3F2 44197","A3F2 (C1S) 44197",null,"2021-01-01","2022-10-31","C1S","A3F2",{"$f":"ROUND(L117/12,2)","v":423.02},{"$f":"I117","v":423.02},{"$f":"J117","v":423.02},{"$f":"HLOOKUP(H117,'CCNL 2019-2021'!$M$73:$AB$75,'CCNL 2019-2021'!$J$75,FALSE)","v":5076.24},null,{"$f":"ROUND(O117/12,2)","v":423.02},{"$f":"O115+Q116+S117","v":5076.24},null,null,null,{"$f":"ROUND(VLOOKUP(H117,$V$291:$W$306,2,FALSE)*12,2)","v":1082.52}]
[null,"A3F2 44866","A3F2 (C1S) 44866",null,"2022-11-01","9999-01-01",{"$f":"G117","v":"C1S"},{"$f":"H117","v":"A3F2"},{"$f":"ROUND(L118/12,2)","v":386.5},{"$f":"I118","v":386.5},{"$f":"J118","v":386.5},{"$f":"VLOOKUP(H118,'CCNL 2019-2021'!$H$79:$I$94,2,FALSE)","v":4638}]
[null,null,null,null,"C2","A3F3"]
[null,"A3F3 34700",{"$f":"CONCATENATE(H120,\" (\",G120,\") \",E120)","v":"A3F3 (C2) 34700"},null,"1995-01-01","1997-06-30","C2","A3F3",148.22,156.49,161.13,{"$f":"ROUND(I120*12,2)","v":1778.64},null,null,{"$f":"ROUND(I120*12,2)","v":1778.64}]
[null,"A3F3 35612","A3F3 (C2) 35612",null,"1997-07-01","1999-12-31","C2","A3F3",182.31,190.58,195.22,2187.7199999999998,null,null,2187.7199999999998]
[null,"A3F3 36526","A3F3 (C2) 36526",null,"2000-01-01","2000-06-30","C2","A3F3",194.19,202.46,207.1,2330.2800000000002,null,null,2330.2800000000002]
[null,"A3F3 36708","A3F3 (C2) 36708",null,"2000-07-01","2000-12-31","C2","A3F3",202.45,210.72,215.35999999999999,2429.4,null,null,2429.4]
[null,"A3F3 36892","A3F3 (C2) 36892",null,"2001-01-01","2001-12-31","C2","A3F3",205.55,213.82,218.45999999999998,2466.6,null,null,2466.6]
[null,"A3F3 37257","A3F3 (C2) 37257",null,"2002-01-01","2002-12-31","C2","A3F3",224.15,232.42,237.05999999999997,2689.8,null,null,2689.8,"INCREMENTI ANNUI POST 31/12/2019"]
[null,"A3F3 37622","A3F3 (C2) 37622",null,"2003-01-01","2007-12-30","C2","A3F3",225.15,233.41,238.05999999999997,2701.8,null,null,2701.8,"DPCM 23.12.2021",null,null,"CCNL 2019 -2021"]
[null,"A3F3 39447","A3F3 (C2) 39447",null,"2007-12-31","2019-12-31","C2","A3F3",259.33999999999997,259.33999999999997,259.33999999999997,3112.08,null,null,3112.08,"dal 2020","dal 2021",null,"dal 2021"]
[null,"A3F3 43831","A3F3 (C2) 43831",null,"2020-01-01","2020-12-31","C2","A3F3",{"$f":"ROUND(L128/12,2)","v":371.92},{"$f":"I128","v":371.92},{"$f":"J128","v":371.92},{"$f":"HLOOKUP(H128,'CCNL 2019-2021'!$M$73:$AB$75,'CCNL 2019-2021'!$J$74,FALSE)","v":4463.04},null,{"$f":"ROUND(O128/12,2)","v":371.92},{"$f":"O127+P128","v":4463.08},{"$f":"HLOOKUP(H128,$E$270:$T$277,8,FALSE)","v":1351},{"$f":"HLOOKUP(H128,$E$291:$T$298,8,FALSE)","v":1273}]
[null,"A3F3 44197","A3F3 (C2) 44197",null,"2021-01-01","2022-10-31","C2","A3F3",{"$f":"ROUND(L129/12,2)","v":455.63},{"$f":"I129","v":455.63},{"$f":"J129","v":455.63},{"$f":"HLOOKUP(H129,'CCNL 2019-2021'!$M$73:$AB$75,'CCNL 2019-2021'!$J$75,FALSE)","v":5467.5599999999995},null,{"$f":"ROUND(O129/12,2)","v":455.63},{"$f":"O127+Q128+S129","v":5467.6},null,null,null,{"$f":"ROUND(VLOOKUP(H129,$V$291:$W$306,2,FALSE)*12,2)","v":1082.52}]
[null,"A3F3 44866","A3F3 (C2) 44866",null,"2022-11-01","9999-01-01",{"$f":"G129","v":"C2"},{"$f":"H129","v":"A3F3"},{"$f":"ROUND(L130/12,2)","v":386.5},{"$f":"I130","v":386.5},{"$f":"J130","v":386.5},{"$f":"VLOOKUP(H130,'CCNL 2019-2021'!$H$79:$I$94,2,FALSE)","v":4638}]
[null,null,null,null,"C3","A3F4"]
[null,"A3F4 34700",{"$f":"CONCATENATE(H132,\" (\",G132,\") \",E132)","v":"A3F4 (C3) 34700"},null,"1995-01-01","1997-06-30","C3","A3F4",158.04,167.33,171.98,{"$f":"ROUND(I132*12,2)","v":1896.48},null,null,{"$f":"ROUND(I132*12,2)","v":1896.48}]
[null,"A3F4 35612","A3F4 (C3) 35612",null,"1997-07-01","1999-12-31","C3","A3F4",195.74,205.03000000000003,209.68,2348.88,null,null,2348.88]
[null,"A3F4 36526","A3F4 (C3) 36526",null,"2000-01-01","2000-06-30","C3","A3F4",208.65,217.94000000000003,222.59,2503.8000000000002,null,null,2503.8000000000002]
[null,"A3F4 36708","A3F4 (C3) 36708",null,"2000-07-01","2000-12-31","C3","A3F4",217.95000000000002,227.24000000000004,231.89000000000001,2615.4,null,null,2615.4]
[null,"A3F4 36892","A3F4 (C3) 36892",null,"2001-01-01","2001-12-31","C3","A3F4",222.08,231.37000000000003,236.02,2664.96,null,null,2664.96]
[null,"A3F4 37257","A3F4 (C3) 37257",null,"2002-01-01","2002-12-31","C3","A3F4",242.88000000000002,252.17000000000004,256.82,2914.56,null,null,2914.56,"INCREMENTI ANNUI POST 31/12/2019"]
[null,"A3F4 37622","A3F4 (C3) 37622",null,"2003-01-01","2007-12-30","C3","A3F4",243.88000000000002,253.17000000000004,257.82,2926.56,null,null,2926.56,"DPCM 23.12.2021",null,null,"CCNL 2019 -2021"]
[null,"A3F4 39447","A3F4 (C3) 39447",null,"2007-12-31","2019-12-31","C3","A3F4",280.87,280.87,280.87,3370.44,null,null,3370.44,"dal 2020","dal 2021",null,"dal 2021"]
[null,"A3F4 43831","A3F4 (C3) 43831",null,"2020-01-01","2020-12-31","C3","A3F4",{"$f":"ROUND(L140/12,2)","v":395.12},{"$f":"I140","v":395.12},{"$f":"J140","v":395.12},{"$f":"HLOOKUP(H140,'CCNL 2019-2021'!$M$73:$AB$75,'CCNL 2019-2021'!$J$74,FALSE)","v":4741.4399999999996},null,{"$f":"ROUND(O140/12,2)","v":395.12},{"$f":"O139+P140","v":4741.4400000000005},{"$f":"HLOOKUP(H140,$E$270:$T$277,8,FALSE)","v":1371},{"$f":"HLOOKUP(H140,$E$291:$T$298,8,FALSE)","v":1266}]
[null,"A3F4 44197","A3F4 (C3) 44197",null,"2021-01-01","2022-10-31","C3","A3F4",{"$f":"ROUND(L141/12,2)","v":476.58},{"$f":"I141","v":476.58},{"$f":"J141","v":476.58},{"$f":"HLOOKUP(H141,'CCNL 2019-2021'!$M$73:$AB$75,'CCNL 2019-2021'!$J$75,FALSE)","v":5718.9599999999991},null,{"$f":"ROUND(O141/12,2)","v":476.58},{"$f":"O139+Q140+S141","v":5718.9600000000009},null,null,null,{"$f":"ROUND(VLOOKUP(H141,$V$291:$W$306,2,FALSE)*12,2)","v":1082.52}]
[null,"A3F4 44866","A3F4 (C3) 44866",null,"2022-11-01","9999-01-01",{"$f":"G141","v":"C3"},{"$f":"H141","v":"A3F4"},{"$f":"ROUND(L142/12,2)","v":386.5},{"$f":"I142","v":386.5},{"$f":"J142","v":386.5},{"$f":"VLOOKUP(H142,'CCNL 2019-2021'!$H$79:$I$94,2,FALSE)","v":4638}]
[null,null,null,null,"C3S","A3F5"]
[null,"A3F5 34700",{"$f":"CONCATENATE(H144,\" (\",G144,\") \",E144)","v":"A3F5 (C3S) 34700"},null,"1995-01-01","1997-06-30","C3S","A3F5",158.04,167.33,171.98,{"$f":"ROUND(I144*12,2)","v":1896.48},null,null,{"$f":"ROUND(I144*12,2)","v":1896.48}]
[null,"A3F5 35612","A3F5 (C3S) 35612",null,"1997-07-01","1999-12-31","C3S","A3F5",195.74,205.03000000000003,209.68,2348.88,null,null,2348.88]
[null,"A3F5 36526","A3F5 (C3S) 36526",null,"2000-01-01","2000-06-30","C3S","A3F5",208.65,217.94000000000003,222.59,2503.8000000000002,null,null,2503.8000000000002]
[null,"A3F5 36708","A3F5 (C3S) 36708",null,"2000-07-01","2000-12-31","C3S","A3F5",217.95000000000002,227.24000000000004,231.89000000000001,2615.4,null,null,2615.4]
[null,{"$f":"CONCATENATE(H148,\" \",E148)","v":"A3F5 36892"},"A3F5 (C3S) 36892",null,"2001-01-01","2001-12-31","C3S","A3F5",222.08,231.37000000000003,236.02,2664.96,null,null,2664.96]
[null,"A3F5 37257","A3F5 (C3S) 37257",null,"2002-01-01","2002-12-31","C3S","A3F5",242.88000000000002,252.17000000000004,256.82,2914.56,null,null,2914.56,"INCREMENTI ANNUI POST 31/12/2019"]
[null,"A3F5 37622","A3F5 (C3S) 37622",null,"2003-01-01","2007-12-30","C3S","A3F5",243.88000000000002,253.17000000000004,257.82,2926.56,null,null,2926.56,"DPCM 23.12.2021",null,null,"CCNL 2019 -2021"]
[null,"A3F5 39447","A3F5 (C3S) 39447",null,"2007-12-31","2019-12-31","C3S","A3F5",280.87,280.87,280.87,3370.44,null,null,3370.44,"dal 2020","dal 2021",null,"dal 2021",null," "]
[null,"A3F5 43831","A3F5 (C3S) 43831",null,"2020-01-01","2020-12-31","C3S","A3F5",{"$f":"ROUND(L152/12,2)","v":395.12},{"$f":"I152","v":395.12},{"$f":"J152","v":395.12},{"$f":"HLOOKUP(H152,'CCNL 2019-2021'!$M$73:$AB$75,'CCNL 2019-2021'!$J$74,FALSE)","v":4741.4399999999996},null,{"$f":"ROUND(O152/12,2)","v":395.12},{"$f":"O151+P152","v":4741.4400000000005},{"$f":"HLOOKUP(H152,$E$270:$T$277,8,FALSE)","v":1371},{"$f":"HLOOKUP(H152,$E$291:$T$298,8,FALSE)","v":1266}]
[null,"A3F5 44197","A3F5 (C3S) 44197",null,"2021-01-01","2022-10-31","C3S","A3F5",{"$f":"ROUND(L153/12,2)","v":476.58},{"$f":"I153","v":476.58},{"$f":"J153","v":476.58},{"$f":"HLOOKUP(H153,'CCNL 2019-2021'!$M$73:$AB$75,'CCNL 2019-2021'!$J$75,FALSE)","v":5718.9599999999991},null,{"$f":"ROUND(O153/12,2)","v":476.58},{"$f":"O151+Q152+S153","v":5718.9600000000009},null,null,null,{"$f":"ROUND(VLOOKUP(H153,$V$291:$W$306,2,FALSE)*12,2)","v":1082.52}]
[null,"A3F5 44866","A3F5 (C3S) 44866",null,"2022-11-01","9999-01-01",{"$f":"G153","v":"C3S"},{"$f":"H153","v":"A3F5"},{"$f":"ROUND(L154/12,2)","v":386.5},{"$f":"I154","v":386.5},{"$f":"J154","v":386.5},{"$f":"VLOOKUP(H154,'CCNL 2019-2021'!$H$79:$I$94,2,FALSE)","v":4638}]
[null,null,null,null,"--------","A3F6",null,null,null,null,null,null,null,null,null,"INCREMENTI ANNUI POST 31/12/2019"]
[null,"A3F6 34700",{"$f":"CONCATENATE($F$155,\" \",E156)","v":"A3F6 34700"},null,"1995-01-01","2007-12-30","--------","A3F6",243.88000000000002,253.17000000000004,0,{"$f":"ROUND(I156*12,2)","v":2926.56},null,null,{"$f":"ROUND(I156*12,2)","v":2926.56},"DPCM 23.12.2021",null,null,"CCNL 2019 -2021"]
[null,"A3F6 39447",{"$f":"CONCATENATE($F$155,\" \",E157)","v":"A3F6 39447"},null,"2007-12-31","2019-12-31","--------","A3F6",280.87,280.87,280.87,3370.44,null,null,{"$f":"ROUND(I157*12,2)","v":3370.44},"dal 2020","dal 2021",null,"dal 2021"]
[null,"A3F6 43831","A3F6 43831",null,"2020-01-01","2020-12-31","--------","A3F6",{"$f":"ROUND(L158/12,2)","v":395.12},{"$f":"I158","v":395.12},{"$f":"J158","v":395.12},{"$f":"HLOOKUP(H158,'CCNL 2019-2021'!$M$73:$AB$75,'CCNL 2019-2021'!$J$74,FALSE)","v":4741.4399999999996},null,{"$f":"ROUND(O158/12,2)","v":395.12},{"$f":"O157+P158","v":4741.4400000000005},{"$f":"HLOOKUP(H158,$E$270:$T$277,8,FALSE)","v":1371},{"$f":"HLOOKUP(H158,$E$291:$T$298,8,FALSE)","v":1266}]
[null,"A3F6 44197","A3F6 44197",null,"2021-01-01","2022-10-31","--------","A3F6",{"$f":"ROUND(L159/12,2)","v":476.58},{"$f":"I159","v":476.58},{"$f":"J159","v":476.58},{"$f":"HLOOKUP(H159,'CCNL 2019-2021'!$M$73:$AB$75,'CCNL 2019-2021'!$J$75,FALSE)","v":5718.9599999999991},null,{"$f":"ROUND(O159/12,2)","v":476.58},{"$f":"O157+Q158+S159","v":5718.9600000000009},null,null,null,{"$f":"ROUND(VLOOKUP(H159,$V$291:$W$306,2,FALSE)*12,2)","v":1082.52}]
[null,"A3F6 44866",{"$f":"B160","v":"A3F6 44866"},null,"2022-11-01","9999-01-01",{"$f":"G159","v":"--------"},{"$f":"H159","v":"A3F6"},{"$f":"ROUND(L160/12,2)","v":386.5},{"$f":"I160","v":386.5},{"$f":"J160","v":386.5},{"$f":"VLOOKUP(H160,'CCNL 2019-2021'!$H$79:$I$94,2,FALSE)","v":4638}]
[null,null,null,null,"--------","A3F7",null,null,null,null,null,null,null,null,null,"INCREMENTI ANNUI POST 31/12/2019"]
[null,"A3F7 34700",{"$f":"CONCATENATE($F$161,\" \",E162)","v":"A3F7 34700"},null,"1995-01-01","2007-12-30","--------","A3F7",243.88000000000002,253.17000000000004,0,{"$f":"ROUND(I162*12,2)","v":2926.56},null,null,{"$f":"ROUND(I162*12,2)","v":2926.56},"DPCM 23.12.2021",null,null,"CCNL 2019 -2021"]
[null,"A3F7 39447",{"$f":"CONCATENATE($F$161,\" \",E163)","v":"A3F7 39447"},null,"2007-12-31","2019-12-31","--------","A3F7",280.87,280.87,280.87,3370.44,null,null,{"$f":"ROUND(I163*12,2)","v":3370.44},"dal 2020","dal 2021",null,"dal 2021"]
[null,"A3F7 43831","A3F7 43831",null,"2020-01-01","2020-12-31","--------","A3F7",{"$f":"ROUND(L164/12,2)","v":395.12},{"$f":"I164","v":395.12},{"$f":"J164","v":395.12},{"$f":"HLOOKUP(H164,'CCNL 2019-2021'!$M$73:$AB$75,'CCNL 2019-2021'!$J$74,FALSE)","v":4741.4399999999996},null,{"$f":"ROUND(O164/12,2)","v":395.12},{"$f":"O163+P164","v":4741.4400000000005},{"$f":"HLOOKUP(H164,$E$270:$T$277,8,FALSE)","v":1371},{"$f":"HLOOKUP(H164,$E$291:$T$298,8,FALSE)","v":1266}]
[null,"A3F7 44197","A3F7 44197",null,"2021-01-01","2022-10-31","--------","A3F7",{"$f":"ROUND(L165/12,2)","v":476.58},{"$f":"I165","v":476.58},{"$f":"J165","v":476.58},{"$f":"HLOOKUP(H165,'CCNL 2019-2021'!$M$73:$AB$75,'CCNL 2019-2021'!$J$75,FALSE)","v":5718.9599999999991},null,{"$f":"ROUND(O165/12,2)","v":476.58},{"$f":"O163+Q164+S165","v":5718.9600000000009},null,null,null,{"$f":"ROUND(VLOOKUP(H165,$V$291:$W$306,2,FALSE)*12,2)","v":1082.52},null," "]
[null,"A3F7 44866",{"$f":"B166","v":"A3F7 44866"},null,"2022-11-01","9999-01-01",{"$f":"G165","v":"--------"},{"$f":"H165","v":"A3F7"},{"$f":"ROUND(L166/12,2)","v":386.5},{"$f":"I166","v":386.5},{"$f":"J166","v":386.5},{"$f":"VLOOKUP(H166,'CCNL 2019-2021'!$H$79:$I$94,2,FALSE)","v":4638}]
[]
[]
[1,2,3,4,5,6,7,8,9,10,11,12,13,14,15,16,17,18,19,20,21,22,23,24,null,"CNA ESERCITO"]
[null,"SIGLA MISURA","SIGLA AMM.NE","AMMINISTRAZIONE",null,null,null,"DECORRENZA","A3F7","A3F6","A3F5","A3F4","A3F3","A3F2","A3F1","A2F6","A2F5","A2F4","A2F3","A2F2","A2F1","A1F3","A1F2","A1F1",null,null,"A3F7","A3F6","A3F5 (C3S)","A3F4 (C3)","A3F3 (C2)","A3F2 (C1S)","A3F1 (C1)","A2F6","A2F5","A2F4 (B3S)","A2F3 (B3)","A2F2 (B2)","A2F1 (B1)","A1F3","A1F2 (A1S)","A1F1 (A1)","A3F7","A3F6","A3F5 (C3S)","A3F4 (C3)","A3F3 (C2)","A3F2 (C1S)","A3F1 (C1)","A2F6","A2F5","A2F4 (B3S)","A2F3 (B3)","A2F2 (B2)","A2F1 (B1)","A1F3","A1F2 (A1S)","A1F1 (A1)"]
[{"$f":"CONCATENATE(C171,\" \",H171)","v":"AGR 39814"},"AGR","AGR",null,null,null,{"$f":"VLOOKUP(C171,$U$4:$AA$33,2,FALSE)","v":"POLITICHE AGRICOLE, ALIMENTARI E FORESTALI"},"2009-01-01",3370.44,3370.44,3370.44,3370.44,3112.08,2772.72,2772.72,2483.2800000000002,2483.2800000000002,2483.2800000000002,2483.2800000000002,2246.4,2045.76,1834.2,1834.2,1834.2,null,"POLITICHE AGRICOLE, ALIMENTARI, FORESTALI"]
["AGR 43831","AGR","AGR",null,null,null,null,"2020-01-01",{"$f":"I171+VLOOKUP($B$172,$B$271:$T$285,E267,FALSE)","v":4741.4400000000005},4741.4400000000005,4741.4400000000005,4741.4400000000005,4463.08,4047.72,4047.72,3486.28,3486.28,3486.28,3486.28,3195.4,2996.76,2737.2,2737.2,2737.2,null,"ANNUI DAL 01/01/2020",4741.4400000000005,4741.4400000000005,4741.4400000000005,4741.4400000000005,4463.08,4047.72,4047.72,3486.28,3486.28,3486.28,3486.28,3195.4,2996.76,2737.2,2737.2,2737.2,{"$f":"EXACT(AA172,I172)","v":true},{"$f":"EXACT(AB172,J172)","v":true},{"$f":"EXACT(AC172,K172)","v":true},{"$f":"EXACT(AD172,L172)","v":true},{"$f":"EXACT(AE172,M172)","v":true},{"$f":"EXACT(AF172,N172)","v":true},{"$f":"EXACT(AG172,O172)","v":true},{"$f":"EXACT(AH172,P172)","v":true},{"$f":"EXACT(AI172,Q172)","v":true},{"$f":"EXACT(AJ172,R172)","v":true},{"$f":"EXACT(AK172,S172)","v":true},{"$f":"EXACT(AL172,T172)","v":true},{"$f":"EXACT(AM172,U172)","v":true},{"$f":"EXACT(AN172,V172)","v":true},{"$f":"EXACT(AO172,W172)","v":true},{"$f":"EXACT(AP172,X172)","v":true}]
["AGR 44197","AGR","AGR",null,null,null,null,"2021-01-01",{"$f":"I171+VLOOKUP($B$173,$B$292:$T$306,E288,FALSE)","v":5819.4400000000005},5819.4400000000005,5819.4400000000005,5819.4400000000005,5478.08,4967.7199999999993,4967.7199999999993,4279.2800000000007,4279.2800000000007,4279.2800000000007,4279.2800000000007,3922.4,3677.76,3359.2,3359.2,3359.2,null,"ANNUI DAL 01/01/2021",5819.4400000000005,5819.4400000000005,5819.4400000000005,5819.4400000000005,5478.08,4967.7199999999993,4967.7199999999993,4279.2800000000007,4279.2800000000007,4279.2800000000007,4279.2800000000007,3922.4,3677.76,3359.2,3359.2,3359.2,{"$f":"EXACT(AA173,I173)","v":true},true,true,true,true,true,true,true,true,true,true,true,true,true,true,true]
[{"$f":"CONCATENATE(C174,\" \",H174)","v":"AGR 44866"},"AGR","AGR",null,null,null,null,"2022-11-01",{"$f":"IF(LEFT(I170,2)=\"A3\",VLOOKUP($B$174,$B$313:$J$332,7,FALSE),IF(LEFT(I170,2)=\"A2\",VLOOKUP($B$174,$B$313:$J$332,8,FALSE),IF(LEFT(I170,2)=\"A1\",VLOOKUP($B$174,$B$313:$J$332,9,FALSE),\"????\")))","v":4529.5200000000004},{"$f":"IF(LEFT(J170,2)=\"A3\",VLOOKUP($B$174,$B$313:$J$332,7,FALSE),IF(LEFT(J170,2)=\"A2\",VLOOKUP($B$174,$B$313:$J$332,8,FALSE),IF(LEFT(J170,2)=\"A1\",VLOOKUP($B$174,$B$313:$J$332,9,FALSE),\"????\")))","v":4529.5200000000004},4529.5200000000004,4529.5200000000004,4529.5200000000004,4529.5200000000004,4529.5200000000004,3352.8,3352.8,3352.8,3352.8,3352.8,3352.8,3040.08,3040.08,3040.08]
["AMB 39814","AMB","AMB",null,null,null,{"$f":"VLOOKUP(C175,$U$4:$AA$33,2,FALSE)","v":"TRANSIZIONE ECOLOGICA"},"2009-01-01",3370.44,3370.44,3370.44,3370.44,3112.08,2772.72,2772.72,2483.2800000000002,2483.2800000000002,2483.2800000000002,2483.2800000000002,2246.4,2045.76,1834.2,1834.2,1834.2,null,"TRANSIZIONE ECOLOGICA (Ex Ambiente e Tutela Territorio/mare)"]
["AMB 43831","AMB","AMB",null,null,null,null,"2020-01-01",{"$f":"I175+VLOOKUP($B$176,$B$271:$T$285,E267,FALSE)","v":4741.4400000000005},4741.4400000000005,4741.4400000000005,4741.4400000000005,4463.08,4047.72,4047.72,3486.28,3486.28,3486.28,3486.28,3195.4,2996.76,2737.2,2737.2,2737.2,null,null,4741.4400000000005,4741.4400000000005,4741.4400000000005,4741.4400000000005,4463.08,4047.72,4047.72,3486.28,3486.28,3486.28,3486.28,3195.4,2996.76,2737.2,2737.2,2737.2,{"$f":"EXACT(AA176,I176)","v":true},{"$f":"EXACT(AB176,J176)","v":true},{"$f":"EXACT(AC176,K176)","v":true},{"$f":"EXACT(AD176,L176)","v":true},{"$f":"EXACT(AE176,M176)","v":true},{"$f":"EXACT(AF176,N176)","v":true},{"$f":"EXACT(AG176,O176)","v":true},{"$f":"EXACT(AH176,P176)","v":true},{"$f":"EXACT(AI176,Q176)","v":true},{"$f":"EXACT(AJ176,R176)","v":true},{"$f":"EXACT(AK176,S176)","v":true},{"$f":"EXACT(AL176,T176)","v":true},{"$f":"EXACT(AM176,U176)","v":true},{"$f":"EXACT(AN176,V176)","v":true},{"$f":"EXACT(AO176,W176)","v":true},{"$f":"EXACT(AP176,X176)","v":true}]
["AMB 44197","AMB","AMB",null,null,null,null,"2021-01-01",{"$f":"I175+VLOOKUP($B$177,$B$292:$T$306,E288,FALSE)","v":5260.4400000000005},5260.4400000000005,5260.4400000000005,5260.4400000000005,5063.08,4602.7199999999993,4602.7199999999993,3974.28,3974.28,3974.28,3974.28,3698.4,3425.76,3092.2,3092.2,3092.2,null,null,5260.4400000000005,5260.4400000000005,5260.4400000000005,5260.4400000000005,5063.08,4602.7199999999993,4602.7199999999993,3974.28,3974.28,3974.28,3974.28,3698.4,3425.76,3092.2,3092.2,3092.2,{"$f":"EXACT(AA177,I177)","v":true},true,true,true,true,true,true,true,true,true,true,true,true,true,true,true]
[{"$f":"CONCATENATE(C178,\" \",H178)","v":"AMB 44866"},"AMB","AMB",null,null,null,null,"2022-11-01",{"$f":"IF(LEFT(I170,2)=\"A3\",VLOOKUP($B$178,$B$313:$J$332,7,FALSE),IF(LEFT(I170,2)=\"A2\",VLOOKUP($B$178,$B$313:$J$332,8,FALSE),IF(LEFT(I170,2)=\"A1\",VLOOKUP($B$178,$B$313:$J$332,9,FALSE),\"????\")))","v":4528.68},{"$f":"IF(LEFT(J170,2)=\"A3\",VLOOKUP($B$178,$B$313:$J$332,7,FALSE),IF(LEFT(J170,2)=\"A2\",VLOOKUP($B$178,$B$313:$J$332,8,FALSE),IF(LEFT(J170,2)=\"A1\",VLOOKUP($B$178,$B$313:$J$332,9,FALSE),\"????\")))","v":4528.68},4528.68,4528.68,4528.68,4528.68,4528.68,3352.68,3352.68,3352.68,3352.68,3352.68,3352.68,3040.32,3040.32,3040.32]
["AVV 39814","GIU","AVV",null,null,null,{"$f":"VLOOKUP(C179,$U$4:$AA$33,2,FALSE)","v":"AVVOCATURA"},"2009-01-01",6319.8,6319.8,6319.8,6319.8,5570.16,5192.88,5192.88,4458.12,4458.12,4458.12,4458.12,4083.24,3714.72,3697.44,3697.44,3697.44,null,"AVVOCATURA"]
["AVV 43831","GIU","AVV",null,null,null,null,"2020-01-01",{"$f":"I179+VLOOKUP($B$180,$B$271:$T$285,E267,FALSE)","v":6319.8},6319.8,6319.8,6319.8,5570.16,5192.88,5192.88,4458.12,4458.12,4458.12,4458.12,4083.24,3714.72,3697.44,3697.44,3697.44,null,null,6319.8,6319.8,6319.8,6319.8,5570.16,5192.88,5192.88,4458.12,4458.12,4458.12,4458.12,4083.24,3714.72,3697.44,3697.44,3697.44,{"$f":"EXACT(AA180,I180)","v":true},{"$f":"EXACT(AB180,J180)","v":true},{"$f":"EXACT(AC180,K180)","v":true},{"$f":"EXACT(AD180,L180)","v":true},{"$f":"EXACT(AE180,M180)","v":true},{"$f":"EXACT(AF180,N180)","v":true},{"$f":"EXACT(AG180,O180)","v":true},{"$f":"EXACT(AH180,P180)","v":true},{"$f":"EXACT(AI180,Q180)","v":true},{"$f":"EXACT(AJ180,R180)","v":true},{"$f":"EXACT(AK180,S180)","v":true},{"$f":"EXACT(AL180,T180)","v":true},{"$f":"EXACT(AM180,U180)","v":true},{"$f":"EXACT(AN180,V180)","v":true},{"$f":"EXACT(AO180,W180)","v":true},{"$f":"EXACT(AP180,X180)","v":true}]
["AVV 44197","GIU","AVV",null,null,null,null,"2021-01-01",{"$f":"I179+VLOOKUP($B$181,$B$292:$T$306,E288,FALSE)","v":6737.8},6737.8,6737.8,6737.8,5938.16,5535.88,5535.88,4753.12,4753.12,4753.12,4753.12,4353.24,3960.72,3941.44,3941.44,3941.44,null,null,6319.8,6319.8,6319.8,6319.8,5570.16,5192.88,5192.88,4458.12,4458.12,4458.12,4458.12,4083.24,3714.72,3697.44,3697.44,3697.44,{"$f":"EXACT(AA181,I181)","v":false},false,false,false,false,false,false,false,false,false,false,false,false,false,false,false]
[{"$f":"CONCATENATE(C182,\" \",H182)","v":"AVV 44866"},"GIU","AVV",null,null,null,null,"2022-11-01",{"$f":"IF(LEFT(I170,2)=\"A3\",VLOOKUP($B$182,$B$313:$J$332,7,FALSE),IF(LEFT(I170,2)=\"A2\",VLOOKUP($B$182,$B$313:$J$332,8,FALSE),IF(LEFT(I170,2)=\"A1\",VLOOKUP($B$182,$B$313:$J$332,9,FALSE),\"????\")))","v":5097.6000000000004},{"$f":"IF(LEFT(J170,2)=\"A3\",VLOOKUP($B$182,$B$313:$J$332,7,FALSE),IF(LEFT(J170,2)=\"A2\",VLOOKUP($B$182,$B$313:$J$332,8,FALSE),IF(LEFT(J170,2)=\"A1\",VLOOKUP($B$182,$B$313:$J$332,9,FALSE),\"????\")))","v":5097.6000000000004},5097.6000000000004,5097.6000000000004,5097.6000000000004,5097.6000000000004,5097.6000000000004,3635.76,3635.76,3635.76,3635.76,3635.76,3635.76,3622.32,3622.32,3622.32]
["CDC 39814","GIU","CDC",null,null,null,{"$f":"VLOOKUP(C183,$U$4:$AA$33,2,FALSE)","v":"CORTE DEI CONTI"},"2009-01-01",6319.8,6319.8,6319.8,6319.8,5570.16,5192.88,5192.88,4458.12,4458.12,4458.12,4458.12,4083.24,3714.72,3697.44,3697.44,3697.44,null,"CORTE DEI CONTI"]
["CDC 43831","GIU","CDC",null,null,null,null,"2020-01-01",{"$f":"I183+VLOOKUP($B$184,$B$271:$T$285,E267,FALSE)","v":6319.8},6319.8,6319.8,6319.8,5570.16,5192.88,5192.88,4458.12,4458.12,4458.12,4458.12,4083.24,3714.72,3697.44,3697.44,3697.44,null,null,6319.8,6319.8,6319.8,6319.8,5570.16,5192.88,5192.88,4458.12,4458.12,4458.12,4458.12,4083.24,3714.72,3697.44,3697.44,3697.44,{"$f":"EXACT(AA184,I184)","v":true},{"$f":"EXACT(AB184,J184)","v":true},{"$f":"EXACT(AC184,K184)","v":true},{"$f":"EXACT(AD184,L184)","v":true},{"$f":"EXACT(AE184,M184)","v":true},{"$f":"EXACT(AF184,N184)","v":true},{"$f":"EXACT(AG184,O184)","v":true},{"$f":"EXACT(AH184,P184)","v":true},{"$f":"EXACT(AI184,Q184)","v":true},{"$f":"EXACT(AJ184,R184)","v":true},{"$f":"EXACT(AK184,S184)","v":true},{"$f":"EXACT(AL184,T184)","v":true},{"$f":"EXACT(AM184,U184)","v":true},{"$f":"EXACT(AN184,V184)","v":true},{"$f":"EXACT(AO184,W184)","v":true},{"$f":"EXACT(AP184,X184)","v":true}]
["CDC 44197","GIU","CDC",null,null,null,null,"2021-01-01",{"$f":"I183+VLOOKUP($B$185,$B$292:$T$306,E288,FALSE)","v":6737.8},6737.8,6737.8,6737.8,5938.16,5535.88,5535.88,4753.12,4753.12,4753.12,4753.12,4353.24,3960.72,3941.44,3941.44,3941.44,null,null,6319.8,6319.8,6319.8,6319.8,5570.16,5192.88,5192.88,4458.12,4458.12,4458.12,4458.12,4083.24,3714.72,3697.44,3697.44,3697.44,{"$f":"EXACT(AA185,I185)","v":false},false,false,false,false,false,false,false,false,false,false,false,false,false,false,false]
[{"$f":"CONCATENATE(C186,\" \",H186)","v":"CDC 44866"},"GIU","CDC",null,null,null,null,"2022-11-01",{"$f":"IF(LEFT(I170,2)=\"A3\",VLOOKUP($B$186,$B$313:$J$332,7,FALSE),IF(LEFT(I170,2)=\"A2\",VLOOKUP($B$186,$B$313:$J$332,8,FALSE),IF(LEFT(I170,2)=\"A1\",VLOOKUP($B$186,$B$313:$J$332,9,FALSE),\"????\")))","v":5097.6000000000004},{"$f":"IF(LEFT(J170,2)=\"A3\",VLOOKUP($B$186,$B$313:$J$332,7,FALSE),IF(LEFT(J170,2)=\"A2\",VLOOKUP($B$186,$B$313:$J$332,8,FALSE),IF(LEFT(J170,2)=\"A1\",VLOOKUP($B$186,$B$313:$J$332,9,FALSE),\"????\")))","v":5097.6000000000004},5097.6000000000004,5097.6000000000004,5097.6000000000004,5097.6000000000004,5097.6000000000004,3635.76,3635.76,3635.76,3635.76,3635.76,3635.76,3622.32,3622.32,3622.32]
["CDS 39814","GIU","CDS",null,null,null,{"$f":"VLOOKUP(C187,$U$4:$AA$33,2,FALSE)","v":"CONSIGLIO DI STATO"},"2009-01-01",6319.8,6319.8,6319.8,6319.8,5570.16,5192.88,5192.88,4458.12,4458.12,4458.12,4458.12,4083.24,3714.72,3697.44,3697.44,3697.44,null,"CONSIGLIO DI STATO"]
["CDS 43831","GIU","CDS",null,null,null,null,"2020-01-01",{"$f":"I187+VLOOKUP($B$188,$B$271:$T$285,E267,FALSE)","v":6319.8},6319.8,6319.8,6319.8,5570.16,5192.88,5192.88,4458.12,4458.12,4458.12,4458.12,4083.24,3714.72,3697.44,3697.44,3697.44,null,null,6319.8,6319.8,6319.8,6319.8,5570.16,5192.88,5192.88,4458.12,4458.12,4458.12,4458.12,4083.24,3714.72,3697.44,3697.44,3697.44,{"$f":"EXACT(AA188,I188)","v":true},{"$f":"EXACT(AB188,J188)","v":true},{"$f":"EXACT(AC188,K188)","v":true},{"$f":"EXACT(AD188,L188)","v":true},{"$f":"EXACT(AE188,M188)","v":true},{"$f":"EXACT(AF188,N188)","v":true},{"$f":"EXACT(AG188,O188)","v":true},{"$f":"EXACT(AH188,P188)","v":true},{"$f":"EXACT(AI188,Q188)","v":true},{"$f":"EXACT(AJ188,R188)","v":true},{"$f":"EXACT(AK188,S188)","v":true},{"$f":"EXACT(AL188,T188)","v":true},{"$f":"EXACT(AM188,U188)","v":true},{"$f":"EXACT(AN188,V188)","v":true},{"$f":"EXACT(AO188,W188)","v":true},{"$f":"EXACT(AP188,X188)","v":true}]
["CDS 44197","GIU","CDS",null,null,null,null,"2021-01-01",{"$f":"I187+VLOOKUP($B$189,$B$292:$T$306,E288,FALSE)","v":6737.8},6737.8,6737.8,6737.8,5938.16,5535.88,5535.88,4753.12,4753.12,4753.12,4753.12,4353.24,3960.72,3941.44,3941.44,3941.44,null,null,6319.8,6319.8,6319.8,6319.8,5570.16,5192.88,5192.88,4458.12,4458.12,4458.12,4458.12,4083.24,3714.72,3697.44,3697.44,3697.44,{"$f":"EXACT(AA189,I189)","v":false},false,false,false,false,false,false,false,false,false,false,false,false,false,false,false]
[{"$f":"CONCATENATE(C190,\" \",H190)","v":"CDS 44866"},"GIU","CDS",null,null,null,null,"2022-11-01",{"$f":"IF(LEFT(I170,2)=\"A3\",VLOOKUP($B$190,$B$313:$J$332,7,FALSE),IF(LEFT(I170,2)=\"A2\",VLOOKUP($B$190,$B$313:$J$332,8,FALSE),IF(LEFT(I170,2)=\"A1\",VLOOKUP($B$190,$B$313:$J$332,9,FALSE),\"????\")))","v":5097.6000000000004},{"$f":"IF(LEFT(J170,2)=\"A3\",VLOOKUP($B$190,$B$313:$J$332,7,FALSE),IF(LEFT(J170,2)=\"A2\",VLOOKUP($B$190,$B$313:$J$332,8,FALSE),IF(LEFT(J170,2)=\"A1\",VLOOKUP($B$190,$B$313:$J$332,9,FALSE),\"????\")))","v":5097.6000000000004},5097.6000000000004,5097.6000000000004,5097.6000000000004,5097.6000000000004,5097.6000000000004,3635.76,3635.76,3635.76,3635.76,3635.76,3635.76,3622.32,3622.32,3622.32]
["CUL 39814","CUL","CUL",null,null,null,{"$f":"VLOOKUP(C191,$U$4:$AA$33,2,FALSE)","v":"CULTURA"},"2009-01-01",3370.44,3370.44,3370.44,3370.44,3112.08,2772.72,2772.72,2483.2800000000002,2483.2800000000002,2483.2800000000002,2483.2800000000002,2246.4,2045.76,1834.2,1834.2,1834.2,null,"CULTURA (Ex Beni e Attività Culturali)"]
["CUL 43831","CUL","CUL",null,null,null,null,"2020-01-01",{"$f":"I191+VLOOKUP($B$192,$B$271:$T$285,E267,FALSE)","v":3370.44},3370.44,3370.44,3370.44,3112.08,2772.72,2772.72,2483.2800000000002,2483.2800000000002,2483.2800000000002,2483.2800000000002,2246.4,2045.76,1834.2,1834.2,1834.2,null,null,3370.44,3370.44,3370.44,3370.44,3112.08,2772.72,2772.72,2483.2800000000002,2483.2800000000002,2483.2800000000002,2483.2800000000002,2246.4,2045.76,1834.2,1834.2,1834.2,{"$f":"EXACT(AA192,I192)","v":true},{"$f":"EXACT(AB192,J192)","v":true},{"$f":"EXACT(AC192,K192)","v":true},{"$f":"EXACT(AD192,L192)","v":true},{"$f":"EXACT(AE192,M192)","v":true},{"$f":"EXACT(AF192,N192)","v":true},{"$f":"EXACT(AG192,O192)","v":true},{"$f":"EXACT(AH192,P192)","v":true},{"$f":"EXACT(AI192,Q192)","v":true},{"$f":"EXACT(AJ192,R192)","v":true},{"$f":"EXACT(AK192,S192)","v":true},{"$f":"EXACT(AL192,T192)","v":true},{"$f":"EXACT(AM192,U192)","v":true},{"$f":"EXACT(AN192,V192)","v":true},{"$f":"EXACT(AO192,W192)","v":true},{"$f":"EXACT(AP192,X192)","v":true}]
["CUL 44197","CUL","CUL",null,null,null,null,"2021-01-01",{"$f":"I191+VLOOKUP($B$193,$B$292:$T$306,E288,FALSE)","v":4418.4400000000005},4418.4400000000005,4418.4400000000005,4418.4400000000005,4099.08,3667.72,3667.72,3254.28,3254.28,3254.28,3254.28,2952.4,2707.76,2439.1999999999998,2439.1999999999998,2439.1999999999998,null,null,4418.4400000000005,4418.4400000000005,4418.4400000000005,4418.4400000000005,4099.08,3667.72,3667.72,3254.28,3254.28,3254.28,3254.28,2952.4,2707.76,2439.1999999999998,2439.1999999999998,2439.1999999999998,{"$f":"EXACT(AA193,I193)","v":true},true,true,true,true,true,true,true,true,true,true,true,true,true,true,true]
[{"$f":"CONCATENATE(C194,\" \",H194)","v":"CUL 44866"},"CUL","CUL",null,null,null,null,"2022-11-01",{"$f":"IF(LEFT(I170,2)=\"A3\",VLOOKUP($B$194,$B$313:$J$332,7,FALSE),IF(LEFT(I170,2)=\"A2\",VLOOKUP($B$194,$B$313:$J$332,8,FALSE),IF(LEFT(I170,2)=\"A1\",VLOOKUP($B$194,$B$313:$J$332,9,FALSE),\"????\")))","v":4529.28},{"$f":"IF(LEFT(J170,2)=\"A3\",VLOOKUP($B$194,$B$313:$J$332,7,FALSE),IF(LEFT(J170,2)=\"A2\",VLOOKUP($B$194,$B$313:$J$332,8,FALSE),IF(LEFT(J170,2)=\"A1\",VLOOKUP($B$194,$B$313:$J$332,9,FALSE),\"????\")))","v":4529.28},4529.28,4529.28,4529.28,4529.28,4529.28,3352.08,3352.08,3352.08,3352.08,3352.08,3352.08,3040.2,3040.2,3040.2]
["DEM 39814","DEM","DEM",null,null,null,{"$f":"VLOOKUP(C195,$U$4:$AA$33,2,FALSE)","v":"DEMANIO - AGENZIA"},"2009-01-01",7949.16,7949.16,7923.72,7603.68,6885.72,6353.76,6061.56,5592.72,5564.76,5535.48,5324.76,4606.92,4140.3599999999997,3825.6,3825.6,3643.8,null,"DEMANIO - AGENZIA",7949.16,7949.16,7923.72,7603.68,6885.72,6353.76,6061.56,5592.72,5564.76,5535.48,5324.76,4606.92,4140.3599999999997,3825.6,3825.6,3643.8]
[{"$f":"CONCATENATE(C196,\" \",H196)","v":"DEM 44866"},"DEM","DEM",null,null,null,null,"2022-11-01",{"$f":"IF(LEFT(I170,2)=\"A3\",VLOOKUP($B$196,$B$313:$J$332,7,FALSE),IF(LEFT(I170,2)=\"A2\",VLOOKUP($B$196,$B$313:$J$332,8,FALSE),IF(LEFT(I170,2)=\"A1\",VLOOKUP($B$196,$B$313:$J$332,9,FALSE),\"????\")))","v":5623.32},{"$f":"IF(LEFT(J170,2)=\"A3\",VLOOKUP($B$196,$B$313:$J$332,7,FALSE),IF(LEFT(J170,2)=\"A2\",VLOOKUP($B$196,$B$313:$J$332,8,FALSE),IF(LEFT(J170,2)=\"A1\",VLOOKUP($B$196,$B$313:$J$332,9,FALSE),\"????\")))","v":5623.32},5623.32,5623.32,5623.32,5623.32,5623.32,3815.4,3815.4,3815.4,3815.4,3815.4,3815.4,3324.72,3324.72,3324.72]
["DIG 39814","DIG","DIG",null,null,null,{"$f":"VLOOKUP(C197,$U$4:$AA$33,2,FALSE)","v":"DIGITALE ITALIA - AGENZIA"},"2009-01-01",11820.72,11820.72,11793.6,11473.8,9921.9599999999991,8860.68,8566.7999999999993,7708.56,7678.92,7651.56,7440.36,6634.32,6056.04,5564.28,5564.28,5380.08,null,"DIGITALE ITALIA - AGENZIA",11820.72,11820.72,11793.6,11473.8,9921.9599999999991,8860.68,8566.7999999999993,7708.56,7678.92,7651.56,7440.36,6634.32,6056.04,5564.28,5564.28,5380.08]
[{"$f":"CONCATENATE(C198,\" \",H198)","v":"DIG 44866"},"DIG","DIG",null,null,null,null,"2022-11-01",{"$f":"IF(LEFT(I170,2)=\"A3\",VLOOKUP($B$198,$B$313:$J$332,7,FALSE),IF(LEFT(I170,2)=\"A2\",VLOOKUP($B$198,$B$313:$J$332,8,FALSE),IF(LEFT(I170,2)=\"A1\",VLOOKUP($B$198,$B$313:$J$332,9,FALSE),\"????\")))","v":8128.56},{"$f":"IF(LEFT(J170,2)=\"A3\",VLOOKUP($B$198,$B$313:$J$332,7,FALSE),IF(LEFT(J170,2)=\"A2\",VLOOKUP($B$198,$B$313:$J$332,8,FALSE),IF(LEFT(J170,2)=\"A1\",VLOOKUP($B$198,$B$313:$J$332,9,FALSE),\"????\")))","v":8128.56},8128.56,8128.56,8128.56,8128.56,8128.56,5731.08,5731.08,5731.08,5731.08,5731.08,5731.08,5061,5061,5061]
["DOG 39814","DOG","DOG",null,null,null,{"$f":"VLOOKUP(C199,$U$4:$AA$33,2,FALSE)","v":"DOGANE E MONOPOLI- AGENZIA"},"2009-01-01",11820.72,11820.72,11793.6,11473.8,9921.9599999999991,8860.68,8566.7999999999993,7708.56,7678.92,7651.56,7440.36,6634.32,6056.04,5564.28,5564.28,5380.08,null,"DOGANE E MONOPOLI- AGENZIA",11820.72,11820.72,11793.6,11473.8,9921.9599999999991,8860.68,8566.7999999999993,7708.56,7678.92,7651.56,7440.36,6634.32,6056.04,5564.28,5564.28,5380.08]
[{"$f":"CONCATENATE(C200,\" \",H200)","v":"DOG 44866"},"DOG","DOG",null,null,null,null,"2022-11-01",{"$f":"IF(LEFT(I170,2)=\"A3\",VLOOKUP($B$200,$B$313:$J$332,7,FALSE),IF(LEFT(I170,2)=\"A2\",VLOOKUP($B$200,$B$313:$J$332,8,FALSE),IF(LEFT(I170,2)=\"A1\",VLOOKUP($B$200,$B$313:$J$332,9,FALSE),\"????\")))","v":8128.56},{"$f":"IF(LEFT(J170,2)=\"A3\",VLOOKUP($B$200,$B$313:$J$332,7,FALSE),IF(LEFT(J170,2)=\"A2\",VLOOKUP($B$200,$B$313:$J$332,8,FALSE),IF(LEFT(J170,2)=\"A1\",VLOOKUP($B$200,$B$313:$J$332,9,FALSE),\"????\")))","v":8128.56},8128.56,8128.56,8128.56,8128.56,8128.56,5731.08,5731.08,5731.08,5731.08,5731.08,5731.08,5061,5061,5061]
["ENT 39814","ENT","ENT",null,null,null,{"$f":"VLOOKUP(C201,$U$4:$AA$33,2,FALSE)","v":"ENTRATE - AGENZIA"},"2009-01-01",7949.16,7949.16,7923.72,7603.68,6885.72,6353.76,6061.56,5592.72,5564.76,5535.48,5324.76,4606.92,4140.3599999999997,3825.6,3825.6,3643.8,null,"ENTRATE - AGENZIA",7949.16,7949.16,7923.72,7603.68,6885.72,6353.76,6061.56,5592.72,5564.76,5535.48,5324.76,4606.92,4140.3599999999997,3825.6,3825.6,3643.8]
[{"$f":"CONCATENATE(C202,\" \",H202)","v":"ENT 44866"},"ENT","ENT",null,null,null,null,"2022-11-01",{"$f":"IF(LEFT(I170,2)=\"A3\",VLOOKUP($B$202,$B$313:$J$332,7,FALSE),IF(LEFT(I170,2)=\"A2\",VLOOKUP($B$202,$B$313:$J$332,8,FALSE),IF(LEFT(I170,2)=\"A1\",VLOOKUP($B$202,$B$313:$J$332,9,FALSE),\"????\")))","v":5623.32},{"$f":"IF(LEFT(J170,2)=\"A3\",VLOOKUP($B$202,$B$313:$J$332,7,FALSE),IF(LEFT(J170,2)=\"A2\",VLOOKUP($B$202,$B$313:$J$332,8,FALSE),IF(LEFT(J170,2)=\"A1\",VLOOKUP($B$202,$B$313:$J$332,9,FALSE),\"????\")))","v":5623.32},5623.32,5623.32,5623.32,5623.32,5623.32,3815.4,3815.4,3815.4,3815.4,3815.4,3815.4,3324.72,3324.72,3324.72]
["GIU 39814","GIU","GIU",null,null,null,{"$f":"VLOOKUP(C203,$U$4:$AA$33,2,FALSE)","v":"GIUSTIZIA"},"2009-01-01",6319.8,6319.8,6319.8,6319.8,5570.16,5192.88,5192.88,4458.12,4458.12,4458.12,4458.12,4083.24,3714.72,3697.44,3697.44,3697.44,null,"GIUSTIZIA"]
["GIU 43831","GIU","GIU",null,null,null,null,"2020-01-01",{"$f":"I203+VLOOKUP($B$204,$B$271:$T$285,E267,FALSE)","v":6319.8},6319.8,6319.8,6319.8,5570.16,5192.88,5192.88,4458.12,4458.12,4458.12,4458.12,4083.24,3714.72,3697.44,3697.44,3697.44,null,null,6319.8,6319.8,6319.8,6319.8,5570.16,5192.88,5192.88,4458.12,4458.12,4458.12,4458.12,4083.24,3714.72,3697.44,3697.44,3697.44,{"$f":"EXACT(AA204,I204)","v":true},{"$f":"EXACT(AB204,J204)","v":true},{"$f":"EXACT(AC204,K204)","v":true},{"$f":"EXACT(AD204,L204)","v":true},{"$f":"EXACT(AE204,M204)","v":true},{"$f":"EXACT(AF204,N204)","v":true},{"$f":"EXACT(AG204,O204)","v":true},{"$f":"EXACT(AH204,P204)","v":true},{"$f":"EXACT(AI204,Q204)","v":true},{"$f":"EXACT(AJ204,R204)","v":true},{"$f":"EXACT(AK204,S204)","v":true},{"$f":"EXACT(AL204,T204)","v":true},{"$f":"EXACT(AM204,U204)","v":true},{"$f":"EXACT(AN204,V204)","v":true},{"$f":"EXACT(AO204,W204)","v":true},{"$f":"EXACT(AP204,X204)","v":true}]
["GIU 44197","GIU","GIU",null,null,null,null,"2021-01-01",{"$f":"I203+VLOOKUP($B$205,$B$292:$T$306,E288,FALSE)","v":6737.8},6737.8,6737.8,6737.8,5938.16,5535.88,5535.88,4753.12,4753.12,4753.12,4753.12,4353.24,3960.72,3941.44,3941.44,3941.44,null,null,6737.8,6737.8,6737.8,6737.8,5938.16,5535.88,5535.88,4753.12,4753.12,4753.12,4753.12,4353.24,3960.72,3941.44,3941.44,3941.44,{"$f":"EXACT(AA205,I205)","v":true},true,true,true,true,true,true,true,true,true,true,true,true,true,true,true]
[{"$f":"CONCATENATE(C206,\" \",H206)","v":"GIU 44866"},"GIU","GIU",null,null,null,null,"2022-11-01",{"$f":"IF(LEFT(I170,2)=\"A3\",VLOOKUP($B$206,$B$313:$J$332,7,FALSE),IF(LEFT(I170,2)=\"A2\",VLOOKUP($B$206,$B$313:$J$332,8,FALSE),IF(LEFT(I170,2)=\"A1\",VLOOKUP($B$206,$B$313:$J$332,9,FALSE),\"????\")))","v":5097.6000000000004},{"$f":"IF(LEFT(J170,2)=\"A3\",VLOOKUP($B$206,$B$313:$J$332,7,FALSE),IF(LEFT(J170,2)=\"A2\",VLOOKUP($B$206,$B$313:$J$332,8,FALSE),IF(LEFT(J170,2)=\"A1\",VLOOKUP($B$206,$B$313:$J$332,9,FALSE),\"????\")))","v":5097.6000000000004},5097.6000000000004,5097.6000000000004,5097.6000000000004,5097.6000000000004,5097.6000000000004,3635.76,3635.76,3635.76,3635.76,3635.76,3635.76,3622.32,3622.32,3622.32]
["INT 39814","INT","INT",null,null,null,{"$f":"VLOOKUP(C207,$U$4:$AA$33,2,FALSE)","v":"INTERNO"},"2009-01-01",3511.8,3511.8,3511.8,3511.8,3370.44,3162.48,3162.48,2811.12,2811.12,2811.12,2811.12,2471.4,1835.04,1620.12,1620.12,1620.12,null,"INTERNO"]
["INT 43831","INT","INT",null,null,null,null,"2020-01-01",{"$f":"I207+VLOOKUP($B$208,$B$271:$T$285,E267,FALSE)","v":4741.8},4741.8,4741.8,4741.8,4463.4400000000005,4047.48,4047.48,3487.12,3487.12,3487.12,3487.12,3195.4,2996.04,2737.12,2737.12,2737.12,null,null,4741.8,4741.8,4741.8,4741.8,4463.4400000000005,4255.4400000000005,4047.48,3838.48,3487.12,3487.12,3487.12,3195.4,2996.04,2737.12,2737.12,2737.12,{"$f":"EXACT(AA208,I208)","v":true},{"$f":"EXACT(AB208,J208)","v":true},{"$f":"EXACT(AC208,K208)","v":true},{"$f":"EXACT(AD208,L208)","v":true},{"$f":"EXACT(AE208,M208)","v":true},{"$f":"EXACT(AF208,N208)","v":false},{"$f":"EXACT(AG208,O208)","v":true},{"$f":"EXACT(AH208,P208)","v":false},{"$f":"EXACT(AI208,Q208)","v":true},{"$f":"EXACT(AJ208,R208)","v":true},{"$f":"EXACT(AK208,S208)","v":true},{"$f":"EXACT(AL208,T208)","v":true},{"$f":"EXACT(AM208,U208)","v":true},{"$f":"EXACT(AN208,V208)","v":true},{"$f":"EXACT(AO208,W208)","v":true},{"$f":"EXACT(AP208,X208)","v":true}]
["INT 44197","INT","INT",null,null,null,null,"2021-01-01",{"$f":"I207+VLOOKUP($B$209,$B$292:$T$306,E288,FALSE)+ROUND(VLOOKUP(I170,$V$291:$X$306,3,FALSE)*12,2)","v":5796.32},5796.32,5796.32,5796.32,5474.9600000000009,4993,4993,4249.6399999999994,4249.6399999999994,4249.6399999999994,4249.6399999999994,3940.92,3786.56,3347.2,3347.2,3347.2,null,null,5322.8,5322.8,5322.8,5322.8,5001.4400000000005,4519.4799999999996,4519.4799999999996,3881.12,3881.12,3881.12,3881.12,3572.4,3418.04,3118.12,3118.12,3118.12,{"$f":"EXACT(AA209,I209)","v":false},false,false,false,false,false,false,false,false,false,false,false,false,false,false,false]
[{"$f":"CONCATENATE(C210,\" \",H210)","v":"INT 44866"},"INT","INT",null,null,null,null,"2022-11-01",{"$f":"IF(LEFT(I170,2)=\"A3\",VLOOKUP($B$210,$B$313:$J$332,7,FALSE),IF(LEFT(I170,2)=\"A2\",VLOOKUP($B$210,$B$313:$J$332,8,FALSE),IF(LEFT(I170,2)=\"A1\",VLOOKUP($B$210,$B$313:$J$332,9,FALSE),\"????\")))","v":4554.72},{"$f":"IF(LEFT(J170,2)=\"A3\",VLOOKUP($B$210,$B$313:$J$332,7,FALSE),IF(LEFT(J170,2)=\"A2\",VLOOKUP($B$210,$B$313:$J$332,8,FALSE),IF(LEFT(J170,2)=\"A1\",VLOOKUP($B$210,$B$313:$J$332,9,FALSE),\"????\")))","v":4554.72},4554.72,4554.72,4554.72,4554.72,4554.72,3461.64,3461.64,3461.64,3461.64,3461.64,3461.64,3028.08,3028.08,3028.08]
["IST 39814","IST","IST",null,null,null,{"$f":"VLOOKUP(C211,$U$4:$AA$33,2,FALSE)","v":"ISTRUZIONE"},"2009-01-01",3370.44,3370.44,3370.44,3370.44,3112.08,2772.72,2772.72,2483.2800000000002,2483.2800000000002,2483.2800000000002,2483.2800000000002,2246.4,2045.76,1834.2,1834.2,1834.2,null,"ISTRUZIONE"]
["IST 43831","IST","IST",null,null,null,null,"2020-01-01",{"$f":"I211+VLOOKUP($B$212,$B$271:$T$285,E267,FALSE)","v":4741.4400000000005},4741.4400000000005,4741.4400000000005,4741.4400000000005,4463.08,4047.72,4047.72,3486.28,3486.28,3486.28,3486.28,3195.4,2996.76,2737.2,2737.2,2737.2,null,null,4741.4400000000005,4741.4400000000005,4741.4400000000005,4741.4400000000005,4463.08,4047.72,4047.72,3486.28,3486.28,3486.28,3486.28,3195.4,2996.76,2737.2,2737.2,2737.2,{"$f":"EXACT(AA212,I212)","v":true},{"$f":"EXACT(AB212,J212)","v":true},{"$f":"EXACT(AC212,K212)","v":true},{"$f":"EXACT(AD212,L212)","v":true},{"$f":"EXACT(AE212,M212)","v":true},{"$f":"EXACT(AF212,N212)","v":true},{"$f":"EXACT(AG212,O212)","v":true},{"$f":"EXACT(AH212,P212)","v":true},{"$f":"EXACT(AI212,Q212)","v":true},{"$f":"EXACT(AJ212,R212)","v":true},{"$f":"EXACT(AK212,S212)","v":true},{"$f":"EXACT(AL212,T212)","v":true},{"$f":"EXACT(AM212,U212)","v":true},{"$f":"EXACT(AN212,V212)","v":true},{"$f":"EXACT(AO212,W212)","v":true},{"$f":"EXACT(AP212,X212)","v":true}]
["IST 44197","IST","IST",null,null,null,null,"2021-01-01",{"$f":"I211+VLOOKUP($B$213,$B$292:$T$306,E288,FALSE)","v":5819.4400000000005},5819.4400000000005,5819.4400000000005,5819.4400000000005,5478.08,4967.7199999999993,4967.7199999999993,4279.2800000000007,4279.2800000000007,4279.2800000000007,4279.2800000000007,3922.4,3677.76,3359.2,3359.2,3359.2,null,null,5819.4400000000005,5819.4400000000005,5819.4400000000005,5819.4400000000005,5478.08,4967.7199999999993,4967.7199999999993,4279.2800000000007,4279.2800000000007,4279.2800000000007,4279.2800000000007,3922.4,3677.76,3359.2,3359.2,3359.2,{"$f":"EXACT(AA213,I213)","v":true},true,true,true,true,true,true,true,true,true,true,true,true,true,true,true]
[{"$f":"CONCATENATE(C214,\" \",H214)","v":"IST 44866"},"IST","IST",null,null,null,null,"2022-11-01",{"$f":"IF(LEFT(I170,2)=\"A3\",VLOOKUP($B$214,$B$313:$J$332,7,FALSE),IF(LEFT(I170,2)=\"A2\",VLOOKUP($B$214,$B$313:$J$332,8,FALSE),IF(LEFT(I170,2)=\"A1\",VLOOKUP($B$214,$B$313:$J$332,9,FALSE),\"????\")))","v":4529.5200000000004},{"$f":"IF(LEFT(J170,2)=\"A3\",VLOOKUP($B$214,$B$313:$J$332,7,FALSE),IF(LEFT(J170,2)=\"A2\",VLOOKUP($B$214,$B$313:$J$332,8,FALSE),IF(LEFT(J170,2)=\"A1\",VLOOKUP($B$214,$B$313:$J$332,9,FALSE),\"????\")))","v":4529.5200000000004},4529.5200000000004,4529.5200000000004,4529.5200000000004,4529.5200000000004,4529.5200000000004,3352.8,3352.8,3352.8,3352.8,3352.8,3352.8,3040.08,3040.08,3040.08]
["LAV 39814","LAV","LAV",null,null,null,{"$f":"VLOOKUP(C215,$U$4:$AA$33,2,FALSE)","v":"LAVORO E POLITICHE SOCIALI"},"2009-01-01",3370.44,3370.44,3370.44,3370.44,3112.08,2772.72,2772.72,2483.2800000000002,2483.2800000000002,2483.2800000000002,2483.2800000000002,2246.4,2045.76,1834.2,1834.2,1834.2,null,"LAVORO E POLITICHE SOCIALI"]
[{"$f":"CONCATENATE(C216,\" \",H216)","v":"LAV 43831"},"LAV","LAV",null,null,null,null,"2020-01-01",{"$f":"I215+VLOOKUP($B$216,$B$271:$T$285,E267,FALSE)","v":4741.4400000000005},4741.4400000000005,4741.4400000000005,4741.4400000000005,4463.08,4047.72,4047.72,3486.28,3486.28,3486.28,3486.28,3195.4,2996.76,2737.2,2737.2,2737.2,null,null,4741.4400000000005,4741.4400000000005,4741.4400000000005,4741.4400000000005,4463.08,4047.72,4047.72,3486.28,3486.28,3486.28,3486.28,3195.4,2996.76,2737.2,2737.2,2737.2,{"$f":"EXACT(AA216,I216)","v":true},{"$f":"EXACT(AB216,J216)","v":true},{"$f":"EXACT(AC216,K216)","v":true},{"$f":"EXACT(AD216,L216)","v":true},{"$f":"EXACT(AE216,M216)","v":true},{"$f":"EXACT(AF216,N216)","v":true},{"$f":"EXACT(AG216,O216)","v":true},{"$f":"EXACT(AH216,P216)","v":true},{"$f":"EXACT(AI216,Q216)","v":true},{"$f":"EXACT(AJ216,R216)","v":true},{"$f":"EXACT(AK216,S216)","v":true},{"$f":"EXACT(AL216,T216)","v":true},{"$f":"EXACT(AM216,U216)","v":true},{"$f":"EXACT(AN216,V216)","v":true},{"$f":"EXACT(AO216,W216)","v":true},{"$f":"EXACT(AP216,X216)","v":true}]
["LAV 44197","LAV","LAV",null,null,null,null,"2021-01-01",{"$f":"I215+VLOOKUP($B$217,$B$292:$T$306,E288,FALSE)","v":5819.4400000000005},5819.4400000000005,5819.4400000000005,5819.4400000000005,5478.08,4967.7199999999993,4967.7199999999993,4279.2800000000007,4279.2800000000007,4279.2800000000007,4279.2800000000007,3922.4,3677.76,3359.2,3359.2,3359.2,null,null,5819.4400000000005,5819.4400000000005,5819.4400000000005,5819.4400000000005,5478.08,4967.7199999999993,4967.7199999999993,4279.2800000000007,4279.2800000000007,4279.2800000000007,4279.2800000000007,3922.4,3677.76,3359.2,3359.2,3359.2,{"$f":"EXACT(AA217,I217)","v":true},true,true,true,true,true,true,true,true,true,true,true,true,true,true,true]
[{"$f":"CONCATENATE(C218,\" \",H218)","v":"LAV 44866"},"LAV","LAV",null,null,null,null,"2022-11-01",{"$f":"IF(LEFT(I170,2)=\"A3\",VLOOKUP($B$218,$B$313:$J$332,7,FALSE),IF(LEFT(I170,2)=\"A2\",VLOOKUP($B$218,$B$313:$J$332,8,FALSE),IF(LEFT(I170,2)=\"A1\",VLOOKUP($B$218,$B$313:$J$332,9,FALSE),\"????\")))","v":4529.5200000000004},{"$f":"IF(LEFT(J170,2)=\"A3\",VLOOKUP($B$218,$B$313:$J$332,7,FALSE),IF(LEFT(J170,2)=\"A2\",VLOOKUP($B$218,$B$313:$J$332,8,FALSE),IF(LEFT(J170,2)=\"A1\",VLOOKUP($B$218,$B$313:$J$332,9,FALSE),\"????\")))","v":4529.5200000000004},4529.5200000000004,4529.5200000000004,4529.5200000000004,4529.5200000000004,4529.5200000000004,3352.8,3352.8,3352.8,3352.8,3352.8,3352.8,3040.08,3040.08,3040.08]
["MAE 39814","MAE","MAE",null,null,null,{"$f":"VLOOKUP(C219,$U$4:$AA$33,2,FALSE)","v":"AFFARI ESTERI E COOPERAZIONE INTERNAZIONALE"},"2009-01-01",3370.44,3370.44,3370.44,3370.44,3112.08,2772.72,2772.72,2483.2800000000002,2483.2800000000002,2483.2800000000002,2483.2800000000002,2246.4,2045.76,1834.2,1834.2,1834.2,null,"AFFARI ESTERI E COOPERAZIONE INTERNAZIONALE"]
["MAE 43831","MAE","MAE",null,null,null,null,"2020-01-01",{"$f":"I219+VLOOKUP($B$220,$B$271:$T$285,E267,FALSE)","v":4741.4400000000005},4741.4400000000005,4741.4400000000005,4741.4400000000005,4463.08,4047.72,4047.72,3486.28,3486.28,3486.28,3486.28,3195.4,2996.76,2737.2,2737.2,2737.2,null,null,4741.4400000000005,4741.4400000000005,4741.4400000000005,4741.4400000000005,4463.08,4047.72,4047.72,3486.28,3486.28,3486.28,3486.28,3195.4,2996.76,2737.2,2737.2,2737.2,{"$f":"EXACT(AA220,I220)","v":true},{"$f":"EXACT(AB220,J220)","v":true},{"$f":"EXACT(AC220,K220)","v":true},{"$f":"EXACT(AD220,L220)","v":true},{"$f":"EXACT(AE220,M220)","v":true},{"$f":"EXACT(AF220,N220)","v":true},{"$f":"EXACT(AG220,O220)","v":true},{"$f":"EXACT(AH220,P220)","v":true},{"$f":"EXACT(AI220,Q220)","v":true},{"$f":"EXACT(AJ220,R220)","v":true},{"$f":"EXACT(AK220,S220)","v":true},{"$f":"EXACT(AL220,T220)","v":true},{"$f":"EXACT(AM220,U220)","v":true},{"$f":"EXACT(AN220,V220)","v":true},{"$f":"EXACT(AO220,W220)","v":true},true]
["MAE 44197","MAE","MAE",null,null,null,null,"2021-01-01",{"$f":"I219+VLOOKUP($B$221,$B$292:$T$306,E288,FALSE)","v":5819.4400000000005},5819.4400000000005,5819.4400000000005,5819.4400000000005,5478.08,4967.7199999999993,4967.7199999999993,4279.2800000000007,4279.2800000000007,4279.2800000000007,4279.2800000000007,3922.4,3677.76,3359.2,3359.2,3359.2,null,null,5819.4400000000005,5819.4400000000005,5819.4400000000005,5819.4400000000005,5478.08,4967.7199999999993,4967.7199999999993,4279.2800000000007,4279.2800000000007,4279.2800000000007,4279.2800000000007,3922.4,3677.76,3359.2,3359.2,3359.2,{"$f":"EXACT(AA221,I221)","v":true},true,true,true,true,true,true,true,true,true,true,true,true,true,true,true]
[{"$f":"CONCATENATE(C222,\" \",H222)","v":"MAE 44866"},"MAE","MAE",null,null,null,null,"2022-11-01",{"$f":"IF(LEFT(I170,2)=\"A3\",VLOOKUP($B$222,$B$313:$J$332,7,FALSE),IF(LEFT(I170,2)=\"A2\",VLOOKUP($B$222,$B$313:$J$332,8,FALSE),IF(LEFT(I170,2)=\"A1\",VLOOKUP($B$222,$B$313:$J$332,9,FALSE),\"????\")))","v":4529.5200000000004},{"$f":"IF(LEFT(J170,2)=\"A3\",VLOOKUP($B$222,$B$313:$J$332,7,FALSE),IF(LEFT(J170,2)=\"A2\",VLOOKUP($B$222,$B$313:$J$332,8,FALSE),IF(LEFT(J170,2)=\"A1\",VLOOKUP($B$222,$B$313:$J$332,9,FALSE),\"????\")))","v":4529.5200000000004},4529.5200000000004,4529.5200000000004,4529.5200000000004,4529.5200000000004,4529.5200000000004,3352.8,3352.8,3352.8,3352.8,3352.8,3352.8,3040.08,3040.08,3040.08]
["MEF 39814","MEF","MEF",null,null,null,{"$f":"VLOOKUP(C223,$U$4:$AA$33,2,FALSE)","v":"ECONOMIA E FINANZE"},"2009-01-01",3930,3930,3930,3930,3526.92,3136.92,3136.92,2788.32,2788.32,2788.32,2788.32,2470.56,2297.64,2101.44,2101.44,2101.44,null,"ECONOMIA E FINANZE"]
["MEF 43466","MEF","MEF",null,null,null,null,"2019-01-01",6319.8,6319.8,6319.8,6319.8,5570.16,5192.88,5192.88,4458.12,4458.12,4458.12,4458.12,4083.24,3714.72,3697.44,3697.44,3697.44]
["MEF 43831","MEF","MEF",null,null,null,null,"2020-01-01",{"$f":"I224+VLOOKUP($B$225,$B$271:$T$285,E267,FALSE)","v":6319.8},6319.8,6319.8,6319.8,5570.16,5192.88,5192.88,4458.12,4458.12,4458.12,4458.12,4083.24,3714.72,3697.44,3697.44,3697.44,null,null,3930,3930,3930,3930,3526.92,3136.92,3136.92,2788.32,2788.32,2788.32,2788.32,2470.56,2297.64,2101.44,2101.44,2101.44,{"$f":"EXACT(AA225,I225)","v":false},{"$f":"EXACT(AB225,J225)","v":false},{"$f":"EXACT(AC225,K225)","v":false},{"$f":"EXACT(AD225,L225)","v":false},{"$f":"EXACT(AE225,M225)","v":false},{"$f":"EXACT(AF225,N225)","v":false},{"$f":"EXACT(AG225,O225)","v":false},{"$f":"EXACT(AH225,P225)","v":false},{"$f":"EXACT(AI225,Q225)","v":false},{"$f":"EXACT(AJ225,R225)","v":false},{"$f":"EXACT(AK225,S225)","v":false},{"$f":"EXACT(AL225,T225)","v":false},{"$f":"EXACT(AM225,U225)","v":false},{"$f":"EXACT(AN225,V225)","v":false},{"$f":"EXACT(AO225,W225)","v":false},{"$f":"EXACT(AP225,X225)","v":false}]
["MEF 44197","MEF","MEF",null,null,null,null,"2021-01-01",{"$f":"I224+VLOOKUP($B$226,$B$292:$T$306,E288,FALSE)","v":6737.8},6737.8,6737.8,6737.8,5938.16,5535.88,5535.88,4753.12,4753.12,4753.12,4753.12,4353.24,3960.72,3941.44,3941.44,3941.44,null,null,4348,4348,4348,4348,3894.92,3479.92,3479.92,3083.32,3083.32,3083.32,3083.32,2740.56,2543.64,2345.44,2345.44,2345.44,{"$f":"EXACT(AA226,I226)","v":false},false,false,false,false,false,false,false,false,false,false,false,false,false,false,false]
[{"$f":"CONCATENATE(C227,\" \",H227)","v":"MEF 44866"},"MEF","MEF",null,null,null,null,"2022-11-01",{"$f":"IF(LEFT(I170,2)=\"A3\",VLOOKUP($B$227,$B$313:$J$332,7,FALSE),IF(LEFT(I170,2)=\"A2\",VLOOKUP($B$227,$B$313:$J$332,8,FALSE),IF(LEFT(I170,2)=\"A1\",VLOOKUP($B$227,$B$313:$J$332,9,FALSE),\"????\")))","v":5097.6000000000004},{"$f":"IF(LEFT(J170,2)=\"A3\",VLOOKUP($B$227,$B$313:$J$332,7,FALSE),IF(LEFT(J170,2)=\"A2\",VLOOKUP($B$227,$B$313:$J$332,8,FALSE),IF(LEFT(J170,2)=\"A1\",VLOOKUP($B$227,$B$313:$J$332,9,FALSE),\"????\")))","v":5097.6000000000004},5097.6000000000004,5097.6000000000004,5097.6000000000004,5097.6000000000004,5097.6000000000004,3635.76,3635.76,3635.76,3635.76,3635.76,3635.76,3622.32,3622.32,3622.32]
["PCM 39814","PCM","PCM",null,null,null,{"$f":"VLOOKUP(C228,$U$4:$AA$33,2,FALSE)","v":"PRESIDENZA CONSIGLIO MINISTRI"},"2009-01-01",5119.4399999999996,5119.4399999999996,5119.4399999999996,5119.4399999999996,4517.5200000000004,4206.12,4206.12,3618.36,3618.36,3618.36,3618.36,3327.84,3023.4,3002.28,3002.28,3002.28,null,"PRESIDENZA CONSIGLIO MINISTRI",5119.4399999999996,5119.4399999999996,5119.4399999999996,5119.4399999999996,4517.5200000000004,4206.12,4206.12,3618.36,3618.36,3618.36,3618.36,3327.84,3023.4,3002.28,3002.28,3002.28]
["SAL 39814","SAL","SAL",null,null,null,{"$f":"VLOOKUP(C229,$U$4:$AA$33,2,FALSE)","v":"SALUTE"},"2009-01-01",3370.44,3370.44,3370.44,3370.44,3112.08,2772.72,2772.72,2483.2800000000002,2483.2800000000002,2483.2800000000002,2483.2800000000002,2246.4,2045.76,1834.2,1834.2,1834.2,null,"SALUTE"]
["SAL 43831","SAL","SAL",null,null,null,null,"2020-01-01",{"$f":"I229+VLOOKUP($B$230,$B$271:$T$285,E267,FALSE)","v":4741.4400000000005},4741.4400000000005,4741.4400000000005,4741.4400000000005,4463.08,4047.72,4047.72,3486.28,3486.28,3486.28,3486.28,3195.4,2996.76,2737.2,2737.2,2737.2,null,null,4741.4400000000005,4741.4400000000005,4741.4400000000005,4741.4400000000005,4463.08,4047.72,4047.72,3486.28,3486.28,3486.28,3486.28,3195.4,2996.76,2737.2,2737.2,2737.2,{"$f":"EXACT(AA230,I230)","v":true},{"$f":"EXACT(AB230,J230)","v":true},{"$f":"EXACT(AC230,K230)","v":true},{"$f":"EXACT(AD230,L230)","v":true},{"$f":"EXACT(AE230,M230)","v":true},{"$f":"EXACT(AF230,N230)","v":true},{"$f":"EXACT(AG230,O230)","v":true},{"$f":"EXACT(AH230,P230)","v":true},{"$f":"EXACT(AI230,Q230)","v":true},{"$f":"EXACT(AJ230,R230)","v":true},{"$f":"EXACT(AK230,S230)","v":true},{"$f":"EXACT(AL230,T230)","v":true},{"$f":"EXACT(AM230,U230)","v":true},{"$f":"EXACT(AN230,V230)","v":true},{"$f":"EXACT(AO230,W230)","v":true},{"$f":"EXACT(AP230,X230)","v":true}]
["SAL 44197","SAL","SAL",null,null,null,null,"2021-01-01",{"$f":"I229+VLOOKUP($B$231,$B$292:$T$306,E288,FALSE)","v":5819.4400000000005},5819.4400000000005,5819.4400000000005,5819.4400000000005,5478.08,4967.7199999999993,4967.7199999999993,4279.2800000000007,4279.2800000000007,4279.2800000000007,4279.2800000000007,3922.4,3677.76,3359.2,3359.2,3359.2,null,null,5819.4400000000005,5819.4400000000005,5819.4400000000005,5819.4400000000005,5478.08,4967.7199999999993,4967.7199999999993,4279.2800000000007,4279.2800000000007,4279.2800000000007,4279.2800000000007,3922.4,3677.76,3359.2,3359.2,3359.2,{"$f":"EXACT(AA231,I231)","v":true},true,true,true,true,true,true,true,true,true,true,true,true,true,true,true]
[{"$f":"CONCATENATE(C232,\" \",H232)","v":"SAL 44866"},"SAL","SAL",null,null,null,null,"2022-11-01",{"$f":"IF(LEFT(I170,2)=\"A3\",VLOOKUP($B$232,$B$313:$J$332,7,FALSE),IF(LEFT(I170,2)=\"A2\",VLOOKUP($B$232,$B$313:$J$332,8,FALSE),IF(LEFT(I170,2)=\"A1\",VLOOKUP($B$232,$B$313:$J$332,9,FALSE),\"????\")))","v":4529.5200000000004},{"$f":"IF(LEFT(J170,2)=\"A3\",VLOOKUP($B$232,$B$313:$J$332,7,FALSE),IF(LEFT(J170,2)=\"A2\",VLOOKUP($B$232,$B$313:$J$332,8,FALSE),IF(LEFT(J170,2)=\"A1\",VLOOKUP($B$232,$B$313:$J$332,9,FALSE),\"????\")))","v":4529.5200000000004},4529.5200000000004,4529.5200000000004,4529.5200000000004,4529.5200000000004,4529.5200000000004,3352.8,3352.8,3352.8,3352.8,3352.8,3352.8,3040.08,3040.08,3040.08]
["SVI 39814","SVI","SVI",null,null,null,{"$f":"VLOOKUP(C233,$U$4:$AA$33,2,FALSE)","v":"SVILUPPO ECONOMICO"},"2009-01-01",3930,3930,3930,3930,3526.92,3136.92,3136.92,2788.32,2788.32,2788.32,2788.32,2470.56,2297.64,2101.44,2101.44,2101.44,null,"SVILUPPO ECONOMICO"]
["SVI 43831","SVI","SVI",null,null,null,null,"2020-01-01",{"$f":"I233+VLOOKUP($B$234,$B$271:$T$285,E267,FALSE)","v":4742},4742,4742,4742,4462.92,4046.92,4046.92,3486.32,3486.32,3486.32,3486.32,3195.56,2996.64,2737.44,2737.44,2737.44,null,null,4742,4742,4742,4742,4462.92,4046.92,4046.92,3486.32,3486.32,3486.32,3486.32,3195.56,2996.64,2737.44,2737.44,2737.44,{"$f":"EXACT(AA234,I234)","v":true},{"$f":"EXACT(AB234,J234)","v":true},{"$f":"EXACT(AC234,K234)","v":true},{"$f":"EXACT(AD234,L234)","v":true},{"$f":"EXACT(AE234,M234)","v":true},{"$f":"EXACT(AF234,N234)","v":true},{"$f":"EXACT(AG234,O234)","v":true},{"$f":"EXACT(AH234,P234)","v":true},{"$f":"EXACT(AI234,Q234)","v":true},{"$f":"EXACT(AJ234,R234)","v":true},{"$f":"EXACT(AK234,S234)","v":true},{"$f":"EXACT(AL234,T234)","v":true},{"$f":"EXACT(AM234,U234)","v":true},{"$f":"EXACT(AN234,V234)","v":true},{"$f":"EXACT(AO234,W234)","v":true},{"$f":"EXACT(AP234,X234)","v":true}]
["SVI 44197","SVI","SVI",null,null,null,null,"2021-01-01",{"$f":"I233+VLOOKUP($B$235,$B$292:$T$306,E288,FALSE)","v":5820},5820,5820,5820,5477.92,4966.92,4966.92,4279.32,4279.32,4279.32,4279.32,3922.56,3677.64,3359.44,3359.44,3359.44,null,null,5820,5820,5820,5820,5477.92,4966.92,4966.92,4279.32,4279.32,4279.32,4279.32,3922.56,3677.64,3359.44,3359.44,3359.44,{"$f":"EXACT(AA235,I235)","v":true},true,true,true,true,true,true,true,true,true,true,true,true,true,true,true]
[{"$f":"CONCATENATE(C236,\" \",H236)","v":"SVI 44866"},"SVI","SVI",null,null,null,null,"2022-11-01",{"$f":"IF(LEFT(I170,2)=\"A3\",VLOOKUP($B$236,$B$313:$J$332,7,FALSE),IF(LEFT(I170,2)=\"A2\",VLOOKUP($B$236,$B$313:$J$332,8,FALSE),IF(LEFT(I170,2)=\"A1\",VLOOKUP($B$236,$B$313:$J$332,9,FALSE),\"????\")))","v":4528.68},{"$f":"IF(LEFT(J170,2)=\"A3\",VLOOKUP($B$236,$B$313:$J$332,7,FALSE),IF(LEFT(J170,2)=\"A2\",VLOOKUP($B$236,$B$313:$J$332,8,FALSE),IF(LEFT(J170,2)=\"A1\",VLOOKUP($B$236,$B$313:$J$332,9,FALSE),\"????\")))","v":4528.68},4528.68,4528.68,4528.68,4528.68,4528.68,3352.68,3352.68,3352.68,3352.68,3352.68,3352.68,3040.32,3040.32,3040.32]
["TAR 39814","GIU","TAR",null,null,null,{"$f":"VLOOKUP(C237,$U$4:$AA$33,2,FALSE)","v":"TAR"},"2009-01-01",6319.8,6319.8,6319.8,6319.8,5570.16,5192.88,5192.88,4458.12,4458.12,4458.12,4458.12,4083.24,3714.72,3697.44,3697.44,3697.44,null,"TAR"]
["TAR 43831","GIU","TAR",null,null,null,null,"2020-01-01",{"$f":"I237+VLOOKUP($B$238,$B$271:$T$285,E267,FALSE)","v":6319.8},6319.8,6319.8,6319.8,5570.16,5192.88,5192.88,4458.12,4458.12,4458.12,4458.12,4083.24,3714.72,3697.44,3697.44,3697.44,null,null,6319.8,6319.8,6319.8,6319.8,5570.16,5192.88,5192.88,4458.12,4458.12,4458.12,4458.12,4083.24,3714.72,3697.44,3697.44,3697.44,{"$f":"EXACT(AA238,I238)","v":true},{"$f":"EXACT(AB238,J238)","v":true},{"$f":"EXACT(AC238,K238)","v":true},{"$f":"EXACT(AD238,L238)","v":true},{"$f":"EXACT(AE238,M238)","v":true},{"$f":"EXACT(AF238,N238)","v":true},{"$f":"EXACT(AG238,O238)","v":true},{"$f":"EXACT(AH238,P238)","v":true},{"$f":"EXACT(AI238,Q238)","v":true},{"$f":"EXACT(AJ238,R238)","v":true},{"$f":"EXACT(AK238,S238)","v":true},{"$f":"EXACT(AL238,T238)","v":true},{"$f":"EXACT(AM238,U238)","v":true},{"$f":"EXACT(AN238,V238)","v":true},{"$f":"EXACT(AO238,W238)","v":true},{"$f":"EXACT(AP238,X238)","v":true}]
["TAR 44197","GIU","TAR",null,null,null,null,"2021-01-01",{"$f":"I237+VLOOKUP($B$239,$B$292:$T$306,E288,FALSE)","v":6737.8},6737.8,6737.8,6737.8,5938.16,5535.88,5535.88,4753.12,4753.12,4753.12,4753.12,4353.24,3960.72,3941.44,3941.44,3941.44,null,null,6319.8,6319.8,6319.8,6319.8,5570.16,5192.88,5192.88,4458.12,4458.12,4458.12,4458.12,4083.24,3714.72,3697.44,3697.44,3697.44,{"$f":"EXACT(AA239,I239)","v":false},false,false,false,false,false,false,false,false,false,false,false,false,false,false,false]
[{"$f":"CONCATENATE(C240,\" \",H240)","v":"TAR 44866"},"GIU","TAR",null,null,null,null,"2022-11-01",{"$f":"IF(LEFT(I170,2)=\"A3\",VLOOKUP($B$240,$B$313:$J$332,7,FALSE),IF(LEFT(I170,2)=\"A2\",VLOOKUP($B$240,$B$313:$J$332,8,FALSE),IF(LEFT(I170,2)=\"A1\",VLOOKUP($B$240,$B$313:$J$332,9,FALSE),\"????\")))","v":5097.6000000000004},{"$f":"IF(LEFT(J170,2)=\"A3\",VLOOKUP($B$240,$B$313:$J$332,7,FALSE),IF(LEFT(J170,2)=\"A2\",VLOOKUP($B$240,$B$313:$J$332,8,FALSE),IF(LEFT(J170,2)=\"A1\",VLOOKUP($B$240,$B$313:$J$332,9,FALSE),\"????\")))","v":5097.6000000000004},5097.6000000000004,5097.6000000000004,5097.6000000000004,5097.6000000000004,5097.6000000000004,3635.76,3635.76,3635.76,3635.76,3635.76,3635.76,3622.32,3622.32,3622.32]
["TRA 39814","TRA","TRA",null,null,null,{"$f":"VLOOKUP(C241,$U$4:$AA$33,2,FALSE)","v":"INFRASTRUTTURE E MOBILITA' SOSTENIBILE"},"2009-01-01",4551.24,4551.24,4551.24,4551.24,3811.68,3238.08,3238.08,2792.28,2792.28,2792.28,2792.28,2444.2800000000002,2139.6,1899.24,1899.24,1899.24,null,"INFRASTRUTTURE E MOBILITA' SOSTENIBILE (Ex Infrastrutture e Trasporti)"]
["TRA 43831","TRA","TRA",null,null,null,null,"2020-01-01",{"$f":"I241+VLOOKUP($B$242,$B$271:$T$285,E267,FALSE)","v":4742.24},4742.24,4742.24,4742.24,4462.68,4047.08,4047.08,3487.28,3487.28,3487.28,3487.28,3196.28,2995.6,2737.24,2737.24,2737.24,null,null,4742.24,4742.24,4742.24,4742.24,4462.68,4047.08,4047.08,3487.28,3487.28,3487.28,3487.28,3196.28,2995.6,2737.24,2737.24,2737.24,{"$f":"EXACT(AA242,I242)","v":true},{"$f":"EXACT(AB242,J242)","v":true},{"$f":"EXACT(AC242,K242)","v":true},{"$f":"EXACT(AD242,L242)","v":true},{"$f":"EXACT(AE242,M242)","v":true},{"$f":"EXACT(AF242,N242)","v":true},{"$f":"EXACT(AG242,O242)","v":true},{"$f":"EXACT(AH242,P242)","v":true},{"$f":"EXACT(AI242,Q242)","v":true},{"$f":"EXACT(AJ242,R242)","v":true},{"$f":"EXACT(AK242,S242)","v":true},{"$f":"EXACT(AL242,T242)","v":true},{"$f":"EXACT(AM242,U242)","v":true},{"$f":"EXACT(AN242,V242)","v":true},{"$f":"EXACT(AO242,W242)","v":true},{"$f":"EXACT(AP242,X242)","v":true}]
["TRA 44197","TRA","TRA",null,null,null,null,"2021-01-01",{"$f":"I241+VLOOKUP($B$243,$B$292:$T$306,E288,FALSE)+ROUND(VLOOKUP(I170,$V$291:$Y$306,4,FALSE)*12,2)","v":5145.32},5145.32,5145.32,5145.32,4957.76,4568.16,4568.16,3882.04,3882.04,3882.04,3882.04,3597.04,3415.3599999999997,3094.4799999999996,3094.4799999999996,3094.4799999999996,null,null,4868.24,4868.24,4868.24,4868.24,4680.68,4291.08,4291.08,3696.28,3696.28,3696.28,3696.28,3411.28,3229.6,2962.24,2962.24,2962.24,{"$f":"EXACT(AA243,I243)","v":false},false,false,false,false,false,false,false,false,false,false,false,false,false,false,false]
["TRA 44562","TRA","TRA",null,null,null,null,"2022-01-01",{"$f":"I241+VLOOKUP($B$244,$B$292:$T$306,E288,FALSE)+ROUND(VLOOKUP(I170,$V$291:$Z$306,5,FALSE)*12,2)","v":5699.36},{"$f":"J241+VLOOKUP($B$244,$B$292:$T$306,F288,FALSE)+ROUND(VLOOKUP(J170,$V$291:$Z$306,5,FALSE)*12,2)","v":5699.36},5699.36,5699.36,5511.8,5122.2,5122.2,4253.68,4253.68,4253.68,4253.68,3968.6800000000003,3787,3358.8399999999997,3358.8399999999997,3358.8399999999997,null,null,null,null,null,null,null,null,null,null,null,null,null,null,null,null,null,null,{"$f":"EXACT(AA244,I244)","v":false},{"$f":"EXACT(AB244,J244)","v":false},{"$f":"EXACT(AC244,K244)","v":false},{"$f":"EXACT(AD244,L244)","v":false},{"$f":"EXACT(AE244,M244)","v":false},{"$f":"EXACT(AF244,N244)","v":false},{"$f":"EXACT(AG244,O244)","v":false},{"$f":"EXACT(AH244,P244)","v":false},{"$f":"EXACT(AI244,Q244)","v":false},{"$f":"EXACT(AJ244,R244)","v":false},{"$f":"EXACT(AK244,S244)","v":false},{"$f":"EXACT(AL244,T244)","v":false},{"$f":"EXACT(AM244,U244)","v":false},{"$f":"EXACT(AN244,V244)","v":false},{"$f":"EXACT(AO244,W244)","v":false},{"$f":"EXACT(AP244,X244)","v":false}]
[{"$f":"CONCATENATE(C245,\" \",H245)","v":"TRA 44866"},"TRA","TRA",null,null,null,null,"2022-11-01",{"$f":"IF(LEFT(I170,2)=\"A3\",VLOOKUP($B$245,$B$313:$J$332,7,FALSE),IF(LEFT(I170,2)=\"A2\",VLOOKUP($B$245,$B$313:$J$332,8,FALSE),IF(LEFT(I170,2)=\"A1\",VLOOKUP($B$245,$B$313:$J$332,9,FALSE),\"????\")))","v":4683.88},{"$f":"IF(LEFT(J170,2)=\"A3\",VLOOKUP($B$245,$B$313:$J$332,7,FALSE),IF(LEFT(J170,2)=\"A2\",VLOOKUP($B$245,$B$313:$J$332,8,FALSE),IF(LEFT(J170,2)=\"A1\",VLOOKUP($B$245,$B$313:$J$332,9,FALSE),\"????\")))","v":4683.88},4683.88,4683.88,4683.88,4683.88,4683.88,3462.4,3462.4,3462.4,3462.4,3462.4,3462.4,3039.48,3039.48,3039.48]
["TUR 39814","TUR","TUR",null,null,null,{"$f":"VLOOKUP(C246,$U$4:$AA$33,2,FALSE)","v":"TURISMO"},"2009-01-01",3370.44,3370.44,3370.44,3370.44,3112.08,2772.72,2772.72,2483.2800000000002,2483.2800000000002,2483.2800000000002,2483.2800000000002,2246.4,2045.76,1834.2,1834.2,1834.2,null,"TURISMO"]
["TUR 43831","TUR","TUR",null,null,null,null,"2020-01-01",{"$f":"I246+VLOOKUP($B$247,$B$271:$T$285,E267,FALSE)","v":3370.44},3370.44,3370.44,3370.44,3112.08,2772.72,2772.72,2483.2800000000002,2483.2800000000002,2483.2800000000002,2483.2800000000002,2246.4,2045.76,1834.2,1834.2,1834.2,null,null,0,0,0,0,0,0,0,0,0,0,0,0,0,0,0,0,{"$f":"EXACT(AA247,I247)","v":false},false,false,false,false,false,false,false,false,false,false,false,false,false,false,false]
["TUR 44197","TUR","TUR",null,null,null,null,"2021-01-01",{"$f":"I246+VLOOKUP($B$248,$B$292:$T$306,E288,FALSE)","v":4418.4400000000005},4418.4400000000005,4418.4400000000005,4418.4400000000005,4099.08,3667.72,3667.72,3254.28,3254.28,3254.28,3254.28,2952.4,2707.76,2439.1999999999998,2439.1999999999998,2439.1999999999998,null,null,0,0,0,0,0,0,0,0,0,0,0,0,0,0,0,0,false,false,false,false,false,false,false,false,false,false,false,false,false,false,false,false]
[{"$f":"CONCATENATE(C249,\" \",H249)","v":"TUR 44866"},"TUR","TUR",null,null,null,null,"2022-11-01",{"$f":"IF(LEFT(I170,2)=\"A3\",VLOOKUP($B$249,$B$313:$J$332,7,FALSE),IF(LEFT(I170,2)=\"A2\",VLOOKUP($B$249,$B$313:$J$332,8,FALSE),IF(LEFT(I170,2)=\"A1\",VLOOKUP($B$249,$B$313:$J$332,9,FALSE),\"????\")))","v":4529.28},{"$f":"IF(LEFT(J170,2)=\"A3\",VLOOKUP($B$249,$B$313:$J$332,7,FALSE),IF(LEFT(J170,2)=\"A2\",VLOOKUP($B$249,$B$313:$J$332,8,FALSE),IF(LEFT(J170,2)=\"A1\",VLOOKUP($B$249,$B$313:$J$332,9,FALSE),\"????\")))","v":4529.28},4529.28,4529.28,4529.28,4529.28,4529.28,3352.08,3352.08,3352.08,3352.08,3352.08,3352.08,3040.2,3040.2,3040.2]
["URI 39814","URI","URI",null,null,null,{"$f":"VLOOKUP(C250,$U$4:$AA$33,2,FALSE)","v":"UNIVERSITÀ E RICERCA"},"2009-01-01",4600.8,4600.8,4600.8,4600.8,4059.6,3777.36,3777.36,3250.92,3250.92,3250.92,3250.92,2989.56,2715.96,2692.56,2692.56,2692.56,null,"UNIVERSITÀ E RICERCA"]
["URI 43831","URI","URI",null,null,null,null,"2020-01-01",{"$f":"I250+VLOOKUP($B$251,$B$271:$T$285,E267,FALSE)","v":5971.8},5971.8,5971.8,5971.8,5410.6,5052.3600000000006,5052.3600000000006,4253.92,4253.92,4253.92,4253.92,3938.56,3666.96,3595.56,3595.56,3595.56,null,null,5971.8,5971.8,5971.8,5971.8,5410.6,5052.3600000000006,5052.3600000000006,4253.92,4253.92,4253.92,4253.92,3938.56,3666.96,3595.56,3595.56,3595.56,{"$f":"EXACT(AA251,I251)","v":true},true,true,true,true,true,true,true,true,true,true,true,true,true,true,true]
["URI 44197","URI","URI",null,null,null,null,"2021-01-01",{"$f":"I250+VLOOKUP($B$252,$B$292:$T$306,E288,FALSE)","v":7049.8},7049.8,7049.8,7049.8,6425.6,5972.3600000000006,5972.3600000000006,5046.92,5046.92,5046.92,5046.92,4665.5599999999995,4347.96,4217.5599999999995,4217.5599999999995,4217.5599999999995,null,null,7049.8,7049.8,7049.8,7049.8,6425.6,5972.3600000000006,5972.3600000000006,5046.92,5046.92,5046.92,5046.92,4665.5599999999995,4347.96,4217.5599999999995,4217.5599999999995,4217.5599999999995,true,true,true,true,true,true,true,true,true,true,true,true,true,true,true,true]
[{"$f":"CONCATENATE(C253,\" \",H253)","v":"URI 44866"},"URI","URI",null,null,null,null,"2022-11-01",{"$f":"IF(LEFT(I170,2)=\"A3\",VLOOKUP($B$253,$B$313:$J$332,7,FALSE),IF(LEFT(I170,2)=\"A2\",VLOOKUP($B$253,$B$313:$J$332,8,FALSE),IF(LEFT(I170,2)=\"A1\",VLOOKUP($B$253,$B$313:$J$332,9,FALSE),\"????\")))","v":4529.5200000000004},{"$f":"IF(LEFT(J170,2)=\"A3\",VLOOKUP($B$253,$B$313:$J$332,7,FALSE),IF(LEFT(J170,2)=\"A2\",VLOOKUP($B$253,$B$313:$J$332,8,FALSE),IF(LEFT(J170,2)=\"A1\",VLOOKUP($B$253,$B$313:$J$332,9,FALSE),\"????\")))","v":4529.5200000000004},4529.5200000000004,4529.5200000000004,4529.5200000000004,4529.5200000000004,4529.5200000000004,3352.8,3352.8,3352.8,3352.8,3352.8,3352.8,3040.08,3040.08,3040.08]
["DIF 39814","DIF","DIF",null,null,null,"DIFESA","2009-01-01",{"$f":"LOOKUP(CONCATENATE(I170,\" \",$H$254),$B$6:$B$165,$O$6:$O$165)","v":3370.44},3370.44,3370.44,3370.44,3112.08,2772.72,2772.72,2483.2800000000002,2483.2800000000002,2483.2800000000002,2483.2800000000002,2246.4,2045.76,1834.2,1834.2,1834.2,null,"DIFESA",{"$f":"VLOOKUP(I170,'CCNL 2019-2021'!$B$56:$J$71,2,FALSE)","v":3370.44},{"$f":"VLOOKUP(J170,'CCNL 2019-2021'!$B$56:$J$71,2,FALSE)","v":3370.44},{"$f":"VLOOKUP(K170,'CCNL 2019-2021'!$B$56:$J$71,2,FALSE)","v":3370.44},{"$f":"VLOOKUP(L170,'CCNL 2019-2021'!$B$56:$J$71,2,FALSE)","v":3370.44},{"$f":"VLOOKUP(M170,'CCNL 2019-2021'!$B$56:$J$71,2,FALSE)","v":3112.08},{"$f":"VLOOKUP(N170,'CCNL 2019-2021'!$B$56:$J$71,2,FALSE)","v":2772.72},{"$f":"VLOOKUP(O170,'CCNL 2019-2021'!$B$56:$J$71,2,FALSE)","v":2772.72},{"$f":"VLOOKUP(P170,'CCNL 2019-2021'!$B$56:$J$71,2,FALSE)","v":2483.2800000000002},{"$f":"VLOOKUP(Q170,'CCNL 2019-2021'!$B$56:$J$71,2,FALSE)","v":2483.2800000000002},{"$f":"VLOOKUP(R170,'CCNL 2019-2021'!$B$56:$J$71,2,FALSE)","v":2483.2800000000002},{"$f":"VLOOKUP(S170,'CCNL 2019-2021'!$B$56:$J$71,2,FALSE)","v":2483.2800000000002},{"$f":"VLOOKUP(T170,'CCNL 2019-2021'!$B$56:$J$71,2,FALSE)","v":2246.4},{"$f":"VLOOKUP(U170,'CCNL 2019-2021'!$B$56:$J$71,2,FALSE)","v":2045.76},{"$f":"VLOOKUP(V170,'CCNL 2019-2021'!$B$56:$J$71,2,FALSE)","v":1834.2},{"$f":"VLOOKUP(W170,'CCNL 2019-2021'!$B$56:$J$71,2,FALSE)","v":1834.2},{"$f":"VLOOKUP(X170,'CCNL 2019-2021'!$B$56:$J$71,2,FALSE)","v":1834.2},{"$f":"AA254-I254","v":0},{"$f":"AB254-J254","v":0},{"$f":"AC254-K254","v":0},{"$f":"AD254-L254","v":0},{"$f":"AE254-M254","v":0},{"$f":"AF254-N254","v":0},{"$f":"AG254-O254","v":0},{"$f":"AH254-P254","v":0},{"$f":"AI254-Q254","v":0},{"$f":"AJ254-R254","v":0},{"$f":"AK254-S254","v":0},{"$f":"AL254-T254","v":0},{"$f":"AM254-U254","v":0},{"$f":"AN254-V254","v":0},{"$f":"AO254-W254","v":0},{"$f":"AP254-X254","v":0}]
["DIF 43466","DIF","DIF",null,null,null,null,"2019-01-01",{"$f":"LOOKUP(CONCATENATE(I170,\" \",$H$255),$B$6:$B$165,$O$6:$O$165)","v":3370.44},3370.44,3370.44,3370.44,3112.08,2772.72,2772.72,2483.2800000000002,2483.2800000000002,2483.2800000000002,2483.2800000000002,2246.4,2045.76,1834.2,1834.2,1834.2,null,null,{"$f":"VLOOKUP(I170,'CCNL 2019-2021'!$B$56:$J$71,2,FALSE)","v":3370.44},{"$f":"VLOOKUP(J170,'CCNL 2019-2021'!$B$56:$J$71,2,FALSE)","v":3370.44},{"$f":"VLOOKUP(K170,'CCNL 2019-2021'!$B$56:$J$71,2,FALSE)","v":3370.44},{"$f":"VLOOKUP(L170,'CCNL 2019-2021'!$B$56:$J$71,2,FALSE)","v":3370.44},{"$f":"VLOOKUP(M170,'CCNL 2019-2021'!$B$56:$J$71,2,FALSE)","v":3112.08},{"$f":"VLOOKUP(N170,'CCNL 2019-2021'!$B$56:$J$71,2,FALSE)","v":2772.72},{"$f":"VLOOKUP(O170,'CCNL 2019-2021'!$B$56:$J$71,2,FALSE)","v":2772.72},{"$f":"VLOOKUP(P170,'CCNL 2019-2021'!$B$56:$J$71,2,FALSE)","v":2483.2800000000002},{"$f":"VLOOKUP(Q170,'CCNL 2019-2021'!$B$56:$J$71,2,FALSE)","v":2483.2800000000002},{"$f":"VLOOKUP(R170,'CCNL 2019-2021'!$B$56:$J$71,2,FALSE)","v":2483.2800000000002},{"$f":"VLOOKUP(S170,'CCNL 2019-2021'!$B$56:$J$71,2,FALSE)","v":2483.2800000000002},{"$f":"VLOOKUP(T170,'CCNL 2019-2021'!$B$56:$J$71,2,FALSE)","v":2246.4},{"$f":"VLOOKUP(U170,'CCNL 2019-2021'!$B$56:$J$71,2,FALSE)","v":2045.76},{"$f":"VLOOKUP(V170,'CCNL 2019-2021'!$B$56:$J$71,2,FALSE)","v":1834.2},{"$f":"VLOOKUP(W170,'CCNL 2019-2021'!$B$56:$J$71,2,FALSE)","v":1834.2},{"$f":"VLOOKUP(X170,'CCNL 2019-2021'!$B$56:$J$71,2,FALSE)","v":1834.2},{"$f":"AA255-I255","v":0},0,0,0,0,0,0,0,0,0,0,0,0,0,0,0]
[{"$f":"CONCATENATE(C256,\" \",H256)","v":"DIF 43831"},"DIF","DIF",null,null,null,null,"2020-01-01",{"$f":"LOOKUP(CONCATENATE(I170,\" \",$H$256),$B$6:$B$165,$O$6:$O$165)","v":4741.4400000000005},4741.4400000000005,4741.4400000000005,4741.4400000000005,4463.08,4047.72,4047.72,3486.28,3486.28,3486.28,3486.28,3195.4,2996.76,2737.2,2737.2,2737.2,null,null,{"$f":"VLOOKUP(I170,'CCNL 2019-2021'!$B$56:$J$71,5,FALSE)","v":4741.4399999999996},{"$f":"VLOOKUP(J170,'CCNL 2019-2021'!$B$56:$J$71,5,FALSE)","v":4741.4399999999996},{"$f":"VLOOKUP(K170,'CCNL 2019-2021'!$B$56:$J$71,5,FALSE)","v":4741.4399999999996},{"$f":"VLOOKUP(L170,'CCNL 2019-2021'!$B$56:$J$71,5,FALSE)","v":4741.4399999999996},{"$f":"VLOOKUP(M170,'CCNL 2019-2021'!$B$56:$J$71,5,FALSE)","v":4463.04},{"$f":"VLOOKUP(N170,'CCNL 2019-2021'!$B$56:$J$71,5,FALSE)","v":4047.72},{"$f":"VLOOKUP(O170,'CCNL 2019-2021'!$B$56:$J$71,5,FALSE)","v":4047.72},{"$f":"VLOOKUP(P170,'CCNL 2019-2021'!$B$56:$J$71,5,FALSE)","v":3486.24},{"$f":"VLOOKUP(Q170,'CCNL 2019-2021'!$B$56:$J$71,5,FALSE)","v":3486.24},{"$f":"VLOOKUP(R170,'CCNL 2019-2021'!$B$56:$J$71,5,FALSE)","v":3486.24},{"$f":"VLOOKUP(S170,'CCNL 2019-2021'!$B$56:$J$71,5,FALSE)","v":3486.24},{"$f":"VLOOKUP(T170,'CCNL 2019-2021'!$B$56:$J$71,5,FALSE)","v":3195.36},{"$f":"VLOOKUP(U170,'CCNL 2019-2021'!$B$56:$J$71,5,FALSE)","v":2996.76},{"$f":"VLOOKUP(V170,'CCNL 2019-2021'!$B$56:$J$71,5,FALSE)","v":2737.2},{"$f":"VLOOKUP(W170,'CCNL 2019-2021'!$B$56:$J$71,5,FALSE)","v":2737.2},{"$f":"VLOOKUP(X170,'CCNL 2019-2021'!$B$56:$J$71,5,FALSE)","v":2737.2},0,0,0,0,-3.999999999996362E-2,0,0,-4.0000000000418368E-2,-4.0000000000418368E-2,-4.0000000000418368E-2,-4.0000000000418368E-2,-3.999999999996362E-2,0,0,0,0]
["DIF 44197","DIF","DIF",null,null,null,null,"2021-01-01",{"$f":"LOOKUP(CONCATENATE(I170,\" \",$H$257),$B$6:$B$165,$O$6:$O$165)","v":5718.9600000000009},5718.9600000000009,5718.9600000000009,5718.9600000000009,5467.6,5076.24,5076.24,4273.5600000000004,4273.5600000000004,4273.5600000000004,4273.5600000000004,3999.6800000000003,3825.04,3359.3599999999997,3359.3599999999997,3359.3599999999997,null,null,{"$f":"VLOOKUP(I170,'CCNL 2019-2021'!$B$56:$J$71,9,FALSE)","v":5718.9599999999991},{"$f":"VLOOKUP(J170,'CCNL 2019-2021'!$B$56:$J$71,9,FALSE)","v":5718.9599999999991},{"$f":"VLOOKUP(K170,'CCNL 2019-2021'!$B$56:$J$71,9,FALSE)","v":5718.9599999999991},{"$f":"VLOOKUP(L170,'CCNL 2019-2021'!$B$56:$J$71,9,FALSE)","v":5718.9599999999991},{"$f":"VLOOKUP(M170,'CCNL 2019-2021'!$B$56:$J$71,9,FALSE)","v":5467.5599999999995},{"$f":"VLOOKUP(N170,'CCNL 2019-2021'!$B$56:$J$71,9,FALSE)","v":5076.24},{"$f":"VLOOKUP(O170,'CCNL 2019-2021'!$B$56:$J$71,9,FALSE)","v":5076.24},{"$f":"VLOOKUP(P170,'CCNL 2019-2021'!$B$56:$J$71,9,FALSE)","v":4273.5600000000004},{"$f":"VLOOKUP(Q170,'CCNL 2019-2021'!$B$56:$J$71,9,FALSE)","v":4273.5600000000004},{"$f":"VLOOKUP(R170,'CCNL 2019-2021'!$B$56:$J$71,9,FALSE)","v":4273.5600000000004},{"$f":"VLOOKUP(S170,'CCNL 2019-2021'!$B$56:$J$71,9,FALSE)","v":4273.5600000000004},{"$f":"VLOOKUP(T170,'CCNL 2019-2021'!$B$56:$J$71,9,FALSE)","v":3999.7200000000003},{"$f":"VLOOKUP(U170,'CCNL 2019-2021'!$B$56:$J$71,9,FALSE)","v":3825},{"$f":"VLOOKUP(V170,'CCNL 2019-2021'!$B$56:$J$71,9,FALSE)","v":3359.3999999999996},{"$f":"VLOOKUP(W170,'CCNL 2019-2021'!$B$56:$J$71,9,FALSE)","v":3359.3999999999996},{"$f":"VLOOKUP(X170,'CCNL 2019-2021'!$B$56:$J$71,9,FALSE)","v":3359.3999999999996},0,0,0,0,-4.0000000000873115E-2,0,0,0,0,0,0,3.999999999996362E-2,-3.999999999996362E-2,3.999999999996362E-2,3.999999999996362E-2,3.999999999996362E-2]
[{"$f":"CONCATENATE(C258,\" \",H258)","v":"DIF 44562"},"DIF","DIF",null,null,null,null,"2022-01-01",{"$f":"LOOKUP(CONCATENATE(I170,\" \",$H$258),$B$6:$B$165,$O$6:$O$165)","v":5718.9600000000009},5718.9600000000009,5718.9600000000009,5718.9600000000009,5467.6,5076.24,5076.24,4273.5600000000004,4273.5600000000004,4273.5600000000004,4273.5600000000004,3999.6800000000003,3825.04,3359.3599999999997,3359.3599999999997,3359.3599999999997,null,null,{"$f":"VLOOKUP(I170,'CCNL 2019-2021'!$B$56:$J$71,9,FALSE)","v":5718.9599999999991},{"$f":"VLOOKUP(J170,'CCNL 2019-2021'!$B$56:$J$71,9,FALSE)","v":5718.9599999999991},{"$f":"VLOOKUP(K170,'CCNL 2019-2021'!$B$56:$J$71,9,FALSE)","v":5718.9599999999991},{"$f":"VLOOKUP(L170,'CCNL 2019-2021'!$B$56:$J$71,9,FALSE)","v":5718.9599999999991},{"$f":"VLOOKUP(M170,'CCNL 2019-2021'!$B$56:$J$71,9,FALSE)","v":5467.5599999999995},{"$f":"VLOOKUP(N170,'CCNL 2019-2021'!$B$56:$J$71,9,FALSE)","v":5076.24},{"$f":"VLOOKUP(O170,'CCNL 2019-2021'!$B$56:$J$71,9,FALSE)","v":5076.24},{"$f":"VLOOKUP(P170,'CCNL 2019-2021'!$B$56:$J$71,9,FALSE)","v":4273.5600000000004},{"$f":"VLOOKUP(Q170,'CCNL 2019-2021'!$B$56:$J$71,9,FALSE)","v":4273.5600000000004},{"$f":"VLOOKUP(R170,'CCNL 2019-2021'!$B$56:$J$71,9,FALSE)","v":4273.5600000000004},{"$f":"VLOOKUP(S170,'CCNL 2019-2021'!$B$56:$J$71,9,FALSE)","v":4273.5600000000004},{"$f":"VLOOKUP(T170,'CCNL 2019-2021'!$B$56:$J$71,9,FALSE)","v":3999.7200000000003},{"$f":"VLOOKUP(U170,'CCNL 2019-2021'!$B$56:$J$71,9,FALSE)","v":3825},{"$f":"VLOOKUP(V170,'CCNL 2019-2021'!$B$56:$J$71,9,FALSE)","v":3359.3999999999996},{"$f":"VLOOKUP(W170,'CCNL 2019-2021'!$B$56:$J$71,9,FALSE)","v":3359.3999999999996},{"$f":"VLOOKUP(X170,'CCNL 2019-2021'!$B$56:$J$71,9,FALSE)","v":3359.3999999999996},0,0,0,0,-4.0000000000873115E-2,0,0,0,0,0,0,3.999999999996362E-2,-3.999999999996362E-2,3.999999999996362E-2,3.999999999996362E-2,3.999999999996362E-2]
[{"$f":"CONCATENATE(C259,\" \",H259)","v":"DIF 44866"},"DIF","DIF",null,null,null,null,"2022-11-01",{"$f":"IF(LEFT(I170,2)=\"A3\",VLOOKUP($B$259,$B$313:$J$332,7,FALSE),IF(LEFT(I170,2)=\"A2\",VLOOKUP($B$259,$B$313:$J$332,8,FALSE),IF(LEFT(I170,2)=\"A1\",VLOOKUP($B$259,$B$313:$J$332,9,FALSE),\"????\")))","v":4638},{"$f":"IF(LEFT(J170,2)=\"A3\",VLOOKUP($B$259,$B$313:$J$332,7,FALSE),IF(LEFT(J170,2)=\"A2\",VLOOKUP($B$259,$B$313:$J$332,8,FALSE),IF(LEFT(J170,2)=\"A1\",VLOOKUP($B$259,$B$313:$J$332,9,FALSE),\"????\")))","v":4638},4638,4638,4638,4638,4638,3500.04,3500.04,3500.04,3500.04,3500.04,3500.04,3040.32,3040.32,3040.32]
[]
[{"$f":"CONCATENATE(C261,\" \",H261)","v":"ICE 39814"},"ICE","ICE",null,null,null,{"$f":"VLOOKUP(C261,$U$4:$AA$33,2,FALSE)","v":"COMMERCIO ESTERO (EX)"},"2009-01-01",4365.24,4365.24,4365.24,4365.24,3861.24,3529.44,3529.44,3145.56,3145.56,3145.56,3145.56,3020.64,2771.76,2624.4,2624.4,2624.4]
["COM 39814","COM","COM",null,null,null,{"$f":"VLOOKUP(C262,$U$4:$AA$33,2,FALSE)","v":"COMUNICAZIONI (EX)"},"2009-01-01",3571.92,3571.92,3571.92,3571.92,3354.96,2967.12,2967.12,2632.44,2632.44,2632.44,2632.44,2448.12,2291.7600000000002,2131.44,2131.44,2131.44]
["IND 39814","IND","IND",null,null,null,{"$f":"VLOOKUP(C263,$U$4:$AA$33,2,FALSE)","v":"INDUSTRIA (EX)"},"2009-01-01",3930,3930,3930,3930,3526.92,3136.92,3136.92,2788.32,2788.32,2788.32,2788.32,2470.56,2297.64,2101.44,2101.44,2101.44]
["PEN 39814","PEN","PEN",null,null,null,{"$f":"VLOOKUP(C264,$U$4:$AA$33,2,FALSE)","v":"PENITENZIARIA"},"2009-01-01",5208.12,5208.12,5208.12,5208.12,4921.08,4477.68,4477.68,3802.44,3802.44,3802.44,3802.44,3342.84,3317.04,3293.64,3293.64,3293.64]
[]
[]
[null,1,2,3,4,5,6,7,8,9,10,11,12,13,14,15,16,17,18,19]
[null,"DPCM 23.12.2021 - Incrementi ANNUI degli importi delle indennità di amministrazione spettanti al personale delle aree professionali in servizio presso i Ministeri dal 1.1.2020 (lordo dipendente)"]
[null,null,null,null,"AREA TERZA",null,null,null,null,null,null,"AREA SECONDA",null,null,null,null,null,"AREA PRIMA",null,null,null,null,null,null,null,null,null,null,null,null,null,null,null,null,9,10,11,12,13,14,15,16,17,18,19,20,21,22,23,24]
[null,"SIGLA AMM.NE","MINISTERI",null,"A3F7","A3F6","A3F5","A3F4","A3F3","A3F2","A3F1","A2F6","A2F5","A2F4","A2F3","A2F2","A2F1","A1F3","A1F2","A1F1",null,null,null,null,null,null,null,null,"SIGLA",null,null,"AMM.NE","INIZIO","FINE","A3F7","A3F6","A3F5","A3F4","A3F3","A3F2","A3F1","A2F6","A2F5","A2F4","A2F3","A2F2","A2F1","A1F3","A1F2","A1F1","A3F7","A3F6","A3F5","A3F4","A3F3","A3F2","A3F1","A2F6","A2F5","A2F4","A2F3","A2F2","A2F1","A1F3","A1F2","A1F1","A3F7","A3F6","A3F5","A3F4","A3F3","A3F2","A3F1","A2F6","A2F5","A2F4","A2F3","A2F2","A2F1","A1F3","A1F2","A1F1"]
[null,"AMB","Ministero della Transizione ecologica",null,1371,1371,1371,1371,1351,1275,1275,1003,1003,1003,1003,949,951,903,903,903,null,null,null,null,null,null,null,{"$f":"CONCATENATE(AC271,\" \",AG271)","v":"DOG 39814"},"DOG",697,"L08","IND. AMMINISTRAZIONE DOGANE TERZA AREA F3","2009-01-01","9999-01-01",null,null,null,null,826.83,null,null,null,null,null,null,null,null,null,null,null,{"$f":"IF(AI271=\"\",\"---\",ROUND(VLOOKUP(AB271,$A$171:$X$258,$AI$269,FALSE)/12,2))","v":"---"},{"$f":"IF(AJ271=\"\",\"---\",ROUND(VLOOKUP(AB271,$A$171:$X$258,$AJ$269,FALSE)/12,2))","v":"---"},{"$f":"IF(AK271=\"\",\"---\",ROUND(VLOOKUP(AB271,$A$171:$X$258,$AK$269,FALSE)/12,2))","v":"---"},{"$f":"IF(AL271=\"\",\"---\",ROUND(VLOOKUP(AB271,$A$171:$X$258,$AL$269,FALSE)/12,2))","v":"---"},{"$f":"IF(AM271=\"\",\"---\",ROUND(VLOOKUP(AB271,$A$171:$X$258,$AM$269,FALSE)/12,2))","v":826.83},{"$f":"IF(AN271=\"\",\"---\",ROUND(VLOOKUP(AB271,$A$171:$X$258,$AN$269,FALSE)/12,2))","v":"---"},{"$f":"IF(AO271=\"\",\"---\",ROUND(VLOOKUP(AB271,$A$171:$X$258,$AO$269,FALSE)/12,2))","v":"---"},{"$f":"IF(AP271=\"\",\"---\",ROUND(VLOOKUP(AB271,$A$171:$X$258,$AP$269,FALSE)/12,2))","v":"---"},{"$f":"IF(AQ271=\"\",\"---\",ROUND(VLOOKUP(AB271,$A$171:$X$258,$AQ$269,FALSE)/12,2))","v":"---"},{"$f":"IF(AR271=\"\",\"---\",ROUND(VLOOKUP(AB271,$A$171:$X$258,$AR$269,FALSE)/12,2))","v":"---"},{"$f":"IF(AS271=\"\",\"---\",ROUND(VLOOKUP(AB271,$A$171:$X$258,$AS$269,FALSE)/12,2))","v":"---"},{"$f":"IF(AT271=\"\",\"---\",ROUND(VLOOKUP(AB271,$A$171:$X$258,$AT$269,FALSE)/12,2))","v":"---"},{"$f":"IF(AU271=\"\",\"---\",ROUND(VLOOKUP(AB271,$A$171:$X$258,$AU$269,FALSE)/12,2))","v":"---"},{"$f":"IF(AV271=\"\",\"---\",ROUND(VLOOKUP(AB271,$A$171:$X$258,$AV$269,FALSE)/12,2))","v":"---"},{"$f":"IF(AW271=\"\",\"---\",ROUND(VLOOKUP(AB271,$A$171:$X$258,$AW$269,FALSE)/12,2))","v":"---"},{"$f":"IF(AX271=\"\",\"---\",ROUND(VLOOKUP(AB271,$A$171:$X$258,$AX$269,FALSE)/12,2))","v":"---"},{"$f":"IF(AI271=\"\",\"---\",EXACT(AI271,AY271))","v":"---"},{"$f":"IF(AJ271=\"\",\"---\",EXACT(AJ271,AZ271))","v":"---"},"---","---",true,"---","---","---","---","---","---","---","---","---","---","---"]
[null,"IST","Ministero dell'Istruzione",null,1371,1371,1371,1371,1351,1275,1275,1003,1003,1003,1003,949,951,903,903,903,null,null,null,null,null,null,null,"GIU 43831","GIU",667,"S03","IND. AMM. MIN.GIUSTIZIA AREA I F1-F2-F3","2020-01-01","2020-12-31",526.65,526.65,526.65,526.65,464.18,432.74,432.74,371.51,371.51,371.51,371.51,340.27,null,308.12,308.12,308.12,{"$f":"IF(AI272=\"\",\"---\",ROUND(VLOOKUP(AB272,$A$171:$X$258,$AI$269,FALSE)/12,2))","v":526.65},{"$f":"IF(AJ272=\"\",\"---\",ROUND(VLOOKUP(AB272,$A$171:$X$258,$AJ$269,FALSE)/12,2))","v":526.65},{"$f":"IF(AK272=\"\",\"---\",ROUND(VLOOKUP(AB272,$A$171:$X$258,$AK$269,FALSE)/12,2))","v":526.65},{"$f":"IF(AL272=\"\",\"---\",ROUND(VLOOKUP(AB272,$A$171:$X$258,$AL$269,FALSE)/12,2))","v":526.65},{"$f":"IF(AM272=\"\",\"---\",ROUND(VLOOKUP(AB272,$A$171:$X$258,$AM$269,FALSE)/12,2))","v":464.18},{"$f":"IF(AN272=\"\",\"---\",ROUND(VLOOKUP(AB272,$A$171:$X$258,$AN$269,FALSE)/12,2))","v":432.74},{"$f":"IF(AO272=\"\",\"---\",ROUND(VLOOKUP(AB272,$A$171:$X$258,$AO$269,FALSE)/12,2))","v":432.74},{"$f":"IF(AP272=\"\",\"---\",ROUND(VLOOKUP(AB272,$A$171:$X$258,$AP$269,FALSE)/12,2))","v":371.51},{"$f":"IF(AQ272=\"\",\"---\",ROUND(VLOOKUP(AB272,$A$171:$X$258,$AQ$269,FALSE)/12,2))","v":371.51},{"$f":"IF(AR272=\"\",\"---\",ROUND(VLOOKUP(AB272,$A$171:$X$258,$AR$269,FALSE)/12,2))","v":371.51},{"$f":"IF(AS272=\"\",\"---\",ROUND(VLOOKUP(AB272,$A$171:$X$258,$AS$269,FALSE)/12,2))","v":371.51},{"$f":"IF(AT272=\"\",\"---\",ROUND(VLOOKUP(AB272,$A$171:$X$258,$AT$269,FALSE)/12,2))","v":340.27},{"$f":"IF(AU272=\"\",\"---\",ROUND(VLOOKUP(AB272,$A$171:$X$258,$AU$269,FALSE)/12,2))","v":"---"},{"$f":"IF(AV272=\"\",\"---\",ROUND(VLOOKUP(AB272,$A$171:$X$258,$AV$269,FALSE)/12,2))","v":308.12},{"$f":"IF(AW272=\"\",\"---\",ROUND(VLOOKUP(AB272,$A$171:$X$258,$AW$269,FALSE)/12,2))","v":308.12},{"$f":"IF(AX272=\"\",\"---\",ROUND(VLOOKUP(AB272,$A$171:$X$258,$AX$269,FALSE)/12,2))","v":308.12},{"$f":"IF(AI272=\"\",\"---\",EXACT(AI272,AY272))","v":true},{"$f":"IF(AJ272=\"\",\"---\",EXACT(AJ272,AZ272))","v":true},{"$f":"IF(AK272=\"\",\"---\",EXACT(AK272,BA272))","v":true},{"$f":"IF(AL272=\"\",\"---\",EXACT(AL272,BB272))","v":true},{"$f":"IF(AM272=\"\",\"---\",EXACT(AM272,BC272))","v":true},{"$f":"IF(AN272=\"\",\"---\",EXACT(AN272,BD272))","v":true},{"$f":"IF(AO272=\"\",\"---\",EXACT(AO272,BE272))","v":true},{"$f":"IF(AP272=\"\",\"---\",EXACT(AP272,BF272))","v":true},{"$f":"IF(AQ272=\"\",\"---\",EXACT(AQ272,BG272))","v":true},{"$f":"IF(AR272=\"\",\"---\",EXACT(AR272,BH272))","v":true},{"$f":"IF(AS272=\"\",\"---\",EXACT(AS272,BI272))","v":true},{"$f":"IF(AT272=\"\",\"---\",EXACT(AT272,BJ272))","v":true},{"$f":"IF(AU272=\"\",\"---\",EXACT(AU272,BK272))","v":"---"},{"$f":"IF(AV272=\"\",\"---\",EXACT(AV272,BL272))","v":true},{"$f":"IF(AW272=\"\",\"---\",EXACT(AW272,BM272))","v":true},{"$f":"IF(AX272=\"\",\"---\",EXACT(AX272,BN272))","v":true}]
[null,"URI","Ministero dell'Università e della Ricerca",null,1371,1371,1371,1371,1351,1275,1275,1003,1003,1003,1003,949,951,903,903,903,null,null,null,null,null,null,null,"GIU 44197","GIU",667,"S03","IND. AMM. MIN.GIUSTIZIA AREA I F1-F2-F3","2021-01-01","9999-01-01",561.48,561.48,561.48,561.48,494.85,461.32,461.32,396.09,396.09,396.09,396.09,362.77,null,328.45,328.45,328.45,{"$f":"IF(AI273=\"\",\"---\",ROUND(VLOOKUP(AB273,$A$171:$X$258,$AI$269,FALSE)/12,2))","v":561.48},{"$f":"IF(AJ273=\"\",\"---\",ROUND(VLOOKUP(AB273,$A$171:$X$258,$AJ$269,FALSE)/12,2))","v":561.48},{"$f":"IF(AK273=\"\",\"---\",ROUND(VLOOKUP(AB273,$A$171:$X$258,$AK$269,FALSE)/12,2))","v":561.48},{"$f":"IF(AL273=\"\",\"---\",ROUND(VLOOKUP(AB273,$A$171:$X$258,$AL$269,FALSE)/12,2))","v":561.48},{"$f":"IF(AM273=\"\",\"---\",ROUND(VLOOKUP(AB273,$A$171:$X$258,$AM$269,FALSE)/12,2))","v":494.85},{"$f":"IF(AN273=\"\",\"---\",ROUND(VLOOKUP(AB273,$A$171:$X$258,$AN$269,FALSE)/12,2))","v":461.32},{"$f":"IF(AO273=\"\",\"---\",ROUND(VLOOKUP(AB273,$A$171:$X$258,$AO$269,FALSE)/12,2))","v":461.32},{"$f":"IF(AP273=\"\",\"---\",ROUND(VLOOKUP(AB273,$A$171:$X$258,$AP$269,FALSE)/12,2))","v":396.09},{"$f":"IF(AQ273=\"\",\"---\",ROUND(VLOOKUP(AB273,$A$171:$X$258,$AQ$269,FALSE)/12,2))","v":396.09},{"$f":"IF(AR273=\"\",\"---\",ROUND(VLOOKUP(AB273,$A$171:$X$258,$AR$269,FALSE)/12,2))","v":396.09},{"$f":"IF(AS273=\"\",\"---\",ROUND(VLOOKUP(AB273,$A$171:$X$258,$AS$269,FALSE)/12,2))","v":396.09},{"$f":"IF(AT273=\"\",\"---\",ROUND(VLOOKUP(AB273,$A$171:$X$258,$AT$269,FALSE)/12,2))","v":362.77},{"$f":"IF(AU273=\"\",\"---\",ROUND(VLOOKUP(AB273,$A$171:$X$258,$AU$269,FALSE)/12,2))","v":"---"},{"$f":"IF(AV273=\"\",\"---\",ROUND(VLOOKUP(AB273,$A$171:$X$258,$AV$269,FALSE)/12,2))","v":328.45},{"$f":"IF(AW273=\"\",\"---\",ROUND(VLOOKUP(AB273,$A$171:$X$258,$AW$269,FALSE)/12,2))","v":328.45},{"$f":"IF(AX273=\"\",\"---\",ROUND(VLOOKUP(AB273,$A$171:$X$258,$AX$269,FALSE)/12,2))","v":328.45},true,true,true,true,true,true,true,true,true,true,true,true,"---",true,true,true]
[null,"AGR","Ministero delle Politiche Agricole Alimentari e Forestali",null,1371,1371,1371,1371,1351,1275,1275,1003,1003,1003,1003,949,951,903,903,903,null,null,null,null,null,null,null,"INT 43831","INT",667,"F05","IND. AMM. MIN.INTERNO AREA II F2","2020-01-01","2020-12-31",null,null,null,null,371.95,null,null,290.58999999999997,290.58999999999997,290.58999999999997,290.58999999999997,266.27999999999997,null,null,null,null,{"$f":"IF(AI274=\"\",\"---\",ROUND(VLOOKUP(AB274,$A$171:$X$258,$AI$269,FALSE)/12,2))","v":"---"},{"$f":"IF(AJ274=\"\",\"---\",ROUND(VLOOKUP(AB274,$A$171:$X$258,$AJ$269,FALSE)/12,2))","v":"---"},{"$f":"IF(AK274=\"\",\"---\",ROUND(VLOOKUP(AB274,$A$171:$X$258,$AK$269,FALSE)/12,2))","v":"---"},{"$f":"IF(AL274=\"\",\"---\",ROUND(VLOOKUP(AB274,$A$171:$X$258,$AL$269,FALSE)/12,2))","v":"---"},{"$f":"IF(AM274=\"\",\"---\",ROUND(VLOOKUP(AB274,$A$171:$X$258,$AM$269,FALSE)/12,2))","v":371.95},{"$f":"IF(AN274=\"\",\"---\",ROUND(VLOOKUP(AB274,$A$171:$X$258,$AN$269,FALSE)/12,2))","v":"---"},{"$f":"IF(AO274=\"\",\"---\",ROUND(VLOOKUP(AB274,$A$171:$X$258,$AO$269,FALSE)/12,2))","v":"---"},{"$f":"IF(AP274=\"\",\"---\",ROUND(VLOOKUP(AB274,$A$171:$X$258,$AP$269,FALSE)/12,2))","v":290.58999999999997},{"$f":"IF(AQ274=\"\",\"---\",ROUND(VLOOKUP(AB274,$A$171:$X$258,$AQ$269,FALSE)/12,2))","v":290.58999999999997},{"$f":"IF(AR274=\"\",\"---\",ROUND(VLOOKUP(AB274,$A$171:$X$258,$AR$269,FALSE)/12,2))","v":290.58999999999997},{"$f":"IF(AS274=\"\",\"---\",ROUND(VLOOKUP(AB274,$A$171:$X$258,$AS$269,FALSE)/12,2))","v":290.58999999999997},{"$f":"IF(AT274=\"\",\"---\",ROUND(VLOOKUP(AB274,$A$171:$X$258,$AT$269,FALSE)/12,2))","v":266.27999999999997},{"$f":"IF(AU274=\"\",\"---\",ROUND(VLOOKUP(AB274,$A$171:$X$258,$AU$269,FALSE)/12,2))","v":"---"},{"$f":"IF(AV274=\"\",\"---\",ROUND(VLOOKUP(AB274,$A$171:$X$258,$AV$269,FALSE)/12,2))","v":"---"},{"$f":"IF(AW274=\"\",\"---\",ROUND(VLOOKUP(AB274,$A$171:$X$258,$AW$269,FALSE)/12,2))","v":"---"},{"$f":"IF(AX274=\"\",\"---\",ROUND(VLOOKUP(AB274,$A$171:$X$258,$AX$269,FALSE)/12,2))","v":"---"},"---","---","---","---",true,"---","---",true,true,true,true,true,"---","---","---","---"]
[null,"MAE","Ministero degli Affari Esteri e della Cooperazione Internazionale",null,1371,1371,1371,1371,1351,1275,1275,1003,1003,1003,1003,949,951,903,903,903,null,null,null,null,null,null,null,"INT 44197","INT",667,"F05","IND. AMM. MIN.INTERNO AREA II F2","2021-01-01","9999-01-01",null,null,null,null,416.79,null,null,323.43,323.43,323.43,323.43,297.7,null,null,null,null,{"$f":"IF(AI275=\"\",\"---\",ROUND(VLOOKUP($AB$275,$A$171:$X$258,AI269,FALSE)/12,2)-VLOOKUP(AY270,$V$291:$Z$306,3,FALSE))","v":"---"},"---","---","---",416.79,"---","---",323.43,323.43,323.43,323.43,297.70000000000005,"---","---","---","---","---","---","---","---",true,"---","---",true,true,true,true,true,"---","---","---","---"]
[null,"SAL","Ministero della Salute",null,1371,1371,1371,1371,1351,1275,1275,1003,1003,1003,1003,949,951,903,903,903,null,null,null,null,null,null,null,"LAV 43831","LAV",667,"G05","IND. AMM. MIN.LAVORO AREA II F2","2020-01-01","2020-12-31",null,null,null,null,null,null,null,290.52,290.52,290.52,290.52,266.27999999999997,null,null,null,null,{"$f":"IF(AI276=\"\",\"---\",ROUND(VLOOKUP(AB276,$A$171:$X$258,$AI$269,FALSE)/12,2))","v":"---"},{"$f":"IF(AJ276=\"\",\"---\",ROUND(VLOOKUP(AB276,$A$171:$X$258,$AJ$269,FALSE)/12,2))","v":"---"},{"$f":"IF(AK276=\"\",\"---\",ROUND(VLOOKUP(AB276,$A$171:$X$258,$AK$269,FALSE)/12,2))","v":"---"},{"$f":"IF(AL276=\"\",\"---\",ROUND(VLOOKUP(AB276,$A$171:$X$258,$AL$269,FALSE)/12,2))","v":"---"},{"$f":"IF(AM276=\"\",\"---\",ROUND(VLOOKUP(AB276,$A$171:$X$258,$AM$269,FALSE)/12,2))","v":"---"},{"$f":"IF(AN276=\"\",\"---\",ROUND(VLOOKUP(AB276,$A$171:$X$258,$AN$269,FALSE)/12,2))","v":"---"},{"$f":"IF(AO276=\"\",\"---\",ROUND(VLOOKUP(AB276,$A$171:$X$258,$AO$269,FALSE)/12,2))","v":"---"},{"$f":"IF(AP276=\"\",\"---\",ROUND(VLOOKUP(AB276,$A$171:$X$258,$AP$269,FALSE)/12,2))","v":290.52},{"$f":"IF(AQ276=\"\",\"---\",ROUND(VLOOKUP(AB276,$A$171:$X$258,$AQ$269,FALSE)/12,2))","v":290.52},{"$f":"IF(AR276=\"\",\"---\",ROUND(VLOOKUP(AB276,$A$171:$X$258,$AR$269,FALSE)/12,2))","v":290.52},{"$f":"IF(AS276=\"\",\"---\",ROUND(VLOOKUP(AB276,$A$171:$X$258,$AS$269,FALSE)/12,2))","v":290.52},{"$f":"IF(AT276=\"\",\"---\",ROUND(VLOOKUP(AB276,$A$171:$X$258,$AT$269,FALSE)/12,2))","v":266.27999999999997},{"$f":"IF(AU276=\"\",\"---\",ROUND(VLOOKUP(AB276,$A$171:$X$258,$AU$269,FALSE)/12,2))","v":"---"},{"$f":"IF(AV276=\"\",\"---\",ROUND(VLOOKUP(AB276,$A$171:$X$258,$AV$269,FALSE)/12,2))","v":"---"},{"$f":"IF(AW276=\"\",\"---\",ROUND(VLOOKUP(AB276,$A$171:$X$258,$AW$269,FALSE)/12,2))","v":"---"},{"$f":"IF(AX276=\"\",\"---\",ROUND(VLOOKUP(AB276,$A$171:$X$258,$AX$269,FALSE)/12,2))","v":"---"},"---","---","---","---","---","---","---",true,true,true,true,true,"---","---","---","---"]
[null,"DIF","Ministero della Difesa",null,1371,1371,1371,1371,1351,1275,1275,1003,1003,1003,1003,949,951,903,903,903,null,null,null,null,null,null,null,"LAV 44197","LAV",667,"G05","IND. AMM. MIN.LAVORO AREA II F2","2021-01-01","9999-01-01",null,null,null,null,null,null,null,356.61,356.61,356.61,356.61,326.87,null,null,null,null,"---","---","---","---","---","---","---",356.61,356.61,356.61,356.61,326.87,"---","---","---","---","---","---","---","---","---","---","---",true,true,true,true,true,"---","---","---","---"]
[null,"LAV","Ministero del Lavoro e delle Politiche Sociali",null,1371,1371,1371,1371,1351,1275,1275,1003,1003,1003,1003,949,951,903,903,903,null,null,null,null,null,null,null,{"$f":"CONCATENATE(AC278,\" \",AG278)","v":"MAE 43831"},"MAE",667,"P05","IND. AMM. MIN.AFF.ESTERI AREA II F2","2020-01-01","2020-12-31",395.12,395.12,395.12,395.12,null,337.31,337.31,290.52,290.52,290.52,290.52,266.27999999999997,null,null,null,null,395.12,395.12,395.12,395.12,"---",337.31,337.31,290.52,290.52,290.52,290.52,266.27999999999997,"---","---","---","---",true,true,true,true,"---",true,true,true,true,true,true,true,"---","---","---","---"]
[null,"INT","Ministero dell'Interno",null,1230,1230,1230,1230,1093,885,885,676,676,676,676,724,1161,1117,1117,1117,null,null,null,null,null,null,null,"MAE 44197","MAE",667,"P05","IND. AMM. MIN.AFF.ESTERI AREA II F2","2021-01-01","9999-01-01",484.95,484.95,484.95,484.95,null,413.98,413.98,356.61,356.61,356.61,356.61,326.87,null,null,null,null,484.95,484.95,484.95,484.95,"---",413.98,413.98,356.61,356.61,356.61,356.61,326.87,"---","---","---","---",true,true,true,true,"---",true,true,true,true,true,true,true,"---","---","---","---"]
[null,"SVI","Ministero dello Sviluppo Economico",null,812,812,812,812,936,910,910,698,698,698,698,725,699,636,636,636,null,null,null,null,null,null,null,"MEF 43831","MEF",667,"B04","IND.AMM.MEF AREA II F3/4/5/6 art.1-c.351-L.145/18","2020-01-01","2020-12-31",null,null,null,null,null,null,null,371.51,371.51,371.51,371.51,null,null,null,null,null,"---","---","---","---","---","---","---",371.51,371.51,371.51,371.51,"---","---","---","---","---","---","---","---","---","---","---","---",true,true,true,true,"---","---","---","---","---"]
[null,"TRA","Ministero delle Infrastrutture e della Mobilità Sostenibile",null,191,191,191,191,651,809,809,695,695,695,695,752,856,838,838,838,null,null,null,null,null,null,null,{"$f":"CONCATENATE(AC281,\" \",AG281)","v":"MEF 44197"},"MEF",667,"B04","IND.AMM.MEF AREA II F3/4/5/6 art.1-c.351-L.145/18","2021-01-01","9999-01-01",null,null,null,null,null,null,null,396.09,396.09,396.09,396.09,null,null,null,null,null,"---","---","---","---","---","---","---",396.09,396.09,396.09,396.09,"---","---","---","---","---","---","---","---","---","---","---","---",true,true,true,true,"---","---","---","---","---"]
[null,"CUL","Ministero della Cultura",null,0,0,0,0,0,0,0,0,0,0,0,0,0,0,0,0,null,null,null,null,null,null,null,"PCM 39814","PCM",697,"A18","IND.PRESID. PERS. COM. CAT. A F3 EX AREA III F3","2009-01-01","9999-01-01",426.62,426.62,426.62,426.62,376.46,350.51,350.51,301.52999999999997,301.52999999999997,301.52999999999997,301.52999999999997,277.32,null,null,250.19,250.19,426.62,426.62,426.62,426.62,376.46,350.51,350.51,301.52999999999997,301.52999999999997,301.52999999999997,301.52999999999997,277.32,"---","---",250.19,250.19,true,true,true,true,true,true,true,true,true,true,true,true,"---","---",true,true]
[null,"TUR","Ministero del Turismo",null,0,0,0,0,0,0,0,0,0,0,0,0,0,0,0,0,null,null,null,null,null,null,null,"TRA 43831","TRA",667,"Q06","IND. AMM.MIN.TRASP/SAL.AREA II F3-4-5-6","2020-01-01","2020-12-31",null,null,null,null,null,null,null,290.61,290.61,290.61,290.61,null,null,null,null,null,"---","---","---","---","---","---","---",290.61,290.61,290.61,290.61,"---","---","---","---","---","---","---","---","---","---","---","---",true,true,true,true,"---","---","---","---","---"]
[null,"MEF","Ministero dell'Economia e delle Finanze",null,0,0,0,0,0,0,0,0,0,0,0,0,0,0,0,0,null,null,null,null,null,null,null,"TRA 44197","TRA",667,"Q06","IND. AMM.MIN.TRASP/SAL.AREA II F3-4-5-6","2021-01-01","9999-01-01",null,null,null,null,null,null,null,308.02,308.02,308.02,308.02,null,null,null,null,null,{"$f":"IF(AI284=\"\",\"---\",ROUND(VLOOKUP($AB$284,$A$171:$X$258,AI269,FALSE)/12,2)-VLOOKUP(AY270,$V$291:$Z$306,4,FALSE))","v":"---"},"---","---","---","---","---","---",308.02,308.02,308.02,308.02,"---","---","---","---","---","---","---","---","---","---","---","---",true,true,true,true,"---","---","---","---","---"]
[null,"GIU","Ministero della Giustizia",null,0,0,0,0,0,0,0,0,0,0,0,0,0,0,0,0,null,null,null,null,null,null,null,{"$f":"CONCATENATE(AC285,\" \",AG285)","v":"DIF 43831"},"DIF",667,"R02","IND. AMM. MIN. DIFESA AREA I F1-F2-F3- BASE","2020-01-01","2020-12-31",395.12,395.12,395.12,395.12,371.92,337.31,337.31,290.52,290.52,290.52,290.52,266.27999999999997,249.73,228.1,228.1,228.1,{"$f":"IF(AI285=\"\",\"---\",ROUND(VLOOKUP(AB285,$A$171:$X$258,$AI$269,FALSE)/12,2))","v":395.12},{"$f":"IF(AJ285=\"\",\"---\",ROUND(VLOOKUP(AB285,$A$171:$X$258,$AJ$269,FALSE)/12,2))","v":395.12},{"$f":"IF(AK285=\"\",\"---\",ROUND(VLOOKUP(AB285,$A$171:$X$258,$AK$269,FALSE)/12,2))","v":395.12},{"$f":"IF(AL285=\"\",\"---\",ROUND(VLOOKUP(AB285,$A$171:$X$258,$AL$269,FALSE)/12,2))","v":395.12},{"$f":"IF(AM285=\"\",\"---\",ROUND(VLOOKUP(AB285,$A$171:$X$258,$AM$269,FALSE)/12,2))","v":371.92},{"$f":"IF(AN285=\"\",\"---\",ROUND(VLOOKUP(AB285,$A$171:$X$258,$AN$269,FALSE)/12,2))","v":337.31},{"$f":"IF(AO285=\"\",\"---\",ROUND(VLOOKUP(AB285,$A$171:$X$258,$AO$269,FALSE)/12,2))","v":337.31},{"$f":"IF(AP285=\"\",\"---\",ROUND(VLOOKUP(AB285,$A$171:$X$258,$AP$269,FALSE)/12,2))","v":290.52},{"$f":"IF(AQ285=\"\",\"---\",ROUND(VLOOKUP(AB285,$A$171:$X$258,$AQ$269,FALSE)/12,2))","v":290.52},{"$f":"IF(AR285=\"\",\"---\",ROUND(VLOOKUP(AB285,$A$171:$X$258,$AR$269,FALSE)/12,2))","v":290.52},{"$f":"IF(AS285=\"\",\"---\",ROUND(VLOOKUP(AB285,$A$171:$X$258,$AS$269,FALSE)/12,2))","v":290.52},{"$f":"IF(AT285=\"\",\"---\",ROUND(VLOOKUP(AB285,$A$171:$X$258,$AT$269,FALSE)/12,2))","v":266.27999999999997},{"$f":"IF(AU285=\"\",\"---\",ROUND(VLOOKUP(AB285,$A$171:$X$258,$AU$269,FALSE)/12,2))","v":249.73},{"$f":"IF(AV285=\"\",\"---\",ROUND(VLOOKUP(AB285,$A$171:$X$258,$AV$269,FALSE)/12,2))","v":228.1},{"$f":"IF(AW285=\"\",\"---\",ROUND(VLOOKUP(AB285,$A$171:$X$258,$AW$269,FALSE)/12,2))","v":228.1},{"$f":"IF(AX285=\"\",\"---\",ROUND(VLOOKUP(AB285,$A$171:$X$258,$AX$269,FALSE)/12,2))","v":228.1},{"$f":"IF(AI285=\"\",\"---\",EXACT(AI285,AY285))","v":true},{"$f":"IF(AJ285=\"\",\"---\",EXACT(AJ285,AZ285))","v":true},{"$f":"IF(AK285=\"\",\"---\",EXACT(AK285,BA285))","v":true},{"$f":"IF(AL285=\"\",\"---\",EXACT(AL285,BB285))","v":true},{"$f":"IF(AM285=\"\",\"---\",EXACT(AM285,BC285))","v":true},{"$f":"IF(AN285=\"\",\"---\",EXACT(AN285,BD285))","v":true},{"$f":"IF(AO285=\"\",\"---\",EXACT(AO285,BE285))","v":true},{"$f":"IF(AP285=\"\",\"---\",EXACT(AP285,BF285))","v":true},{"$f":"IF(AQ285=\"\",\"---\",EXACT(AQ285,BG285))","v":true},{"$f":"IF(AR285=\"\",\"---\",EXACT(AR285,BH285))","v":true},{"$f":"IF(AS285=\"\",\"---\",EXACT(AS285,BI285))","v":true},{"$f":"IF(AT285=\"\",\"---\",EXACT(AT285,BJ285))","v":true},{"$f":"IF(AU285=\"\",\"---\",EXACT(AU285,BK285))","v":true},{"$f":"IF(AV285=\"\",\"---\",EXACT(AV285,BL285))","v":true},{"$f":"IF(AW285=\"\",\"---\",EXACT(AW285,BM285))","v":true},{"$f":"IF(AX285=\"\",\"---\",EXACT(AX285,BN285))","v":true}]
[null,"Il Ministero del Turismo è stato istituito nel 2021 per scorporo dal Ministero per i beni e le attività culturali e per il turismo, che contestualmente è stato denominato Ministero della cultura",null,null,null,null,null,null,null,null,null,null,null,null,null,null,null,null,null,null,null,"TABELLA \"E\" CCNL 2019 - 2021","MINISTERO DIFESA","MINISTERO INTERNO","MINISTERO INFRASTRUTTURE E TRASPORTI",null,null,"DIF 44197","DIF",667,"R02","IND. AMM. MIN. DIFESA AREA I F1-F2-F3- BASE","2021-01-01","9999-01-01",386.37,386.37,386.37,386.37,365.42,332.81,332.81,283.94,283.94,283.94,283.94,261.12,246.56,226.27,226.27,226.27,{"$f":"IF(AI286=\"\",\"---\",ROUND(VLOOKUP($AB$286,$A$171:$X$258,AI269,FALSE)/12,2)-VLOOKUP(AY270,$V$291:$Z$306,2,FALSE))","v":386.37},386.37,386.37,386.37,365.42,332.81,332.81,283.94,283.94,283.94,283.94,261.12,246.56,226.26999999999998,226.26999999999998,226.26999999999998,{"$f":"IF(AI285=\"\",\"---\",EXACT(AI286,AY286))","v":true},{"$f":"IF(AJ285=\"\",\"---\",EXACT(AJ286,AZ286))","v":true},true,true,true,true,true,true,true,true,true,true,true,true,true,true]
[null,null,null,null,null,null,null,null,null,null,null,null,null,null,null,null,null,null,null,null,null,null,null,null,"Gli incrementi decorrenti dal 1.1.2022 assorbono e ricomprendono quelli decorrenti dal 1.1.2021.",null,null,null,null,null,null,null,"2020-01-01","2020-12-31",{"$f":"EXACT(AI285,VLOOKUP(AI270,'CCNL 2019-2021'!$B$56:$T$71,16,FALSE))","v":true},{"$f":"EXACT(AJ285,VLOOKUP(AJ270,'CCNL 2019-2021'!$B$56:$T$71,16,FALSE))","v":true},{"$f":"EXACT(AK285,VLOOKUP(AK270,'CCNL 2019-2021'!$B$56:$T$71,16,FALSE))","v":true},{"$f":"EXACT(AL285,VLOOKUP(AL270,'CCNL 2019-2021'!$B$56:$T$71,16,FALSE))","v":true},{"$f":"EXACT(AM285,VLOOKUP(AM270,'CCNL 2019-2021'!$B$56:$T$71,16,FALSE))","v":true},{"$f":"EXACT(AN285,VLOOKUP(AN270,'CCNL 2019-2021'!$B$56:$T$71,16,FALSE))","v":true},{"$f":"EXACT(AO285,VLOOKUP(AO270,'CCNL 2019-2021'!$B$56:$T$71,16,FALSE))","v":true},{"$f":"EXACT(AP285,VLOOKUP(AP270,'CCNL 2019-2021'!$B$56:$T$71,16,FALSE))","v":true},{"$f":"EXACT(AQ285,VLOOKUP(AQ270,'CCNL 2019-2021'!$B$56:$T$71,16,FALSE))","v":true},{"$f":"EXACT(AR285,VLOOKUP(AR270,'CCNL 2019-2021'!$B$56:$T$71,16,FALSE))","v":true},{"$f":"EXACT(AS285,VLOOKUP(AS270,'CCNL 2019-2021'!$B$56:$T$71,16,FALSE))","v":true},{"$f":"EXACT(AT285,VLOOKUP(AT270,'CCNL 2019-2021'!$B$56:$T$71,16,FALSE))","v":true},{"$f":"EXACT(AU285,VLOOKUP(AU270,'CCNL 2019-2021'!$B$56:$T$71,16,FALSE))","v":true},{"$f":"EXACT(AV285,VLOOKUP(AV270,'CCNL 2019-2021'!$B$56:$T$71,16,FALSE))","v":true},{"$f":"EXACT(AW285,VLOOKUP(AW270,'CCNL 2019-2021'!$B$56:$T$71,16,FALSE))","v":true},{"$f":"EXACT(AX285,VLOOKUP(AX270,'CCNL 2019-2021'!$B$56:$T$71,16,FALSE))","v":true}]
[null,1,2,3,4,5,6,7,8,9,10,11,12,13,14,15,16,17,18,19,null,null,"Incrementi Mensili",null,null,null,null,null,null,null,null,null,"2021-01-01","9999-01-01",{"$f":"EXACT(AI286,VLOOKUP(AI270,'CCNL 2019-2021'!$B$56:$T$71,19,FALSE))","v":true},{"$f":"EXACT(AJ286,VLOOKUP(AJ270,'CCNL 2019-2021'!$B$56:$T$71,19,FALSE))","v":true},{"$f":"EXACT(AK286,VLOOKUP(AK270,'CCNL 2019-2021'!$B$56:$T$71,19,FALSE))","v":true},{"$f":"EXACT(AL286,VLOOKUP(AL270,'CCNL 2019-2021'!$B$56:$T$71,19,FALSE))","v":true},{"$f":"EXACT(AM286,VLOOKUP(AM270,'CCNL 2019-2021'!$B$56:$T$71,19,FALSE))","v":true},{"$f":"EXACT(AN286,VLOOKUP(AN270,'CCNL 2019-2021'!$B$56:$T$71,19,FALSE))","v":true},{"$f":"EXACT(AO286,VLOOKUP(AO270,'CCNL 2019-2021'!$B$56:$T$71,19,FALSE))","v":true},{"$f":"EXACT(AP286,VLOOKUP(AP270,'CCNL 2019-2021'!$B$56:$T$71,19,FALSE))","v":true},{"$f":"EXACT(AQ286,VLOOKUP(AQ270,'CCNL 2019-2021'!$B$56:$T$71,19,FALSE))","v":true},{"$f":"EXACT(AR286,VLOOKUP(AR270,'CCNL 2019-2021'!$B$56:$T$71,19,FALSE))","v":true},{"$f":"EXACT(AS286,VLOOKUP(AS270,'CCNL 2019-2021'!$B$56:$T$71,19,FALSE))","v":true},{"$f":"EXACT(AT286,VLOOKUP(AT270,'CCNL 2019-2021'!$B$56:$T$71,19,FALSE))","v":true},{"$f":"EXACT(AU286,VLOOKUP(AU270,'CCNL 2019-2021'!$B$56:$T$71,19,FALSE))","v":true},{"$f":"EXACT(AV286,VLOOKUP(AV270,'CCNL 2019-2021'!$B$56:$T$71,19,FALSE))","v":true},{"$f":"EXACT(AW286,VLOOKUP(AW270,'CCNL 2019-2021'!$B$56:$T$71,19,FALSE))","v":true},{"$f":"EXACT(AX286,VLOOKUP(AX270,'CCNL 2019-2021'!$B$56:$T$71,19,FALSE))","v":true}]
[null,"DPCM 23.12.2021 - Incrementi ANNUI degli importi delle indennità di amministrazione spettanti al personale delle aree professionali in servizio presso i Ministeri dal 1.1.2021 (lordo dipendente)",null,null,null,null,null,null,null,null,null,null,null,null,null,null,null,null,null,null,null,"Posizione economica","dal","dal","dal","dal"]
[null,null,null,null,"AREA TERZA",null,null,null,null,null,null,"AREA SECONDA",null,null,null,null,null,"AREA PRIMA",null,null,null,null,"2021-01-01","2021-01-01","2021-01-01","2022-01-01"]
[null,"SIGLA AMM.NE","MINISTERI",null,"A3F7","A3F6","A3F5","A3F4","A3F3","A3F2","A3F1","A2F6","A2F5","A2F4","A2F3","A2F2","A2F1","A1F3","A1F2","A1F1",null,"A3F7",90.21,39.46,23.09,69.260000000000005]
[null,"AMB","Ministero della Transizione ecologica",null,1890,1890,1890,1890,1951,1830,1830,1491,1491,1491,1491,1452,1380,1258,1258,1258,null,"A3F6",90.21,39.46,23.09,69.260000000000005]
[null,"IST","Ministero dell'Istruzione",null,2449,2449,2449,2449,2366,2195,2195,1796,1796,1796,1796,1676,1632,1525,1525,1525,null,"A3F5",90.21,39.46,23.09,69.260000000000005]
[null,"URI","Ministero dell'Università e della Ricerca",null,2449,2449,2449,2449,2366,2195,2195,1796,1796,1796,1796,1676,1632,1525,1525,1525,null,"A3F4",90.21,39.46,23.09,69.260000000000005]
[null,"AGR","Ministero delle Politiche Agricole Alimentari e Forestali",null,2449,2449,2449,2449,2366,2195,2195,1796,1796,1796,1796,1676,1632,1525,1525,1525,null,"A3F3",90.21,39.46,23.09,69.260000000000005]
[null,"MAE","Ministero degli Affari Esteri e della Cooperazione Internazionale",null,2449,2449,2449,2449,2366,2195,2195,1796,1796,1796,1796,1676,1632,1525,1525,1525,null,"A3F2",90.21,39.46,23.09,69.260000000000005]
[null,"SAL","Ministero della Salute",null,2449,2449,2449,2449,2366,2195,2195,1796,1796,1796,1796,1676,1632,1525,1525,1525,null,"A3F1",90.21,39.46,23.09,69.260000000000005]
[null,"DIF","Ministero della Difesa",null,1266,1266,1266,1266,1273,1221,1221,924,924,924,924,887,913,881,881,881,null,"A2F6",72.19,30.71,15.48,46.45]
[null,"LAV","Ministero del Lavoro e delle Politiche Sociali",null,2449,2449,2449,2449,2366,2195,2195,1796,1796,1796,1796,1676,1632,1525,1525,1525,null,"A2F5",72.19,30.71,15.48,46.45]
[null,"INT","Ministero dell'Interno",null,1811,1811,1811,1811,1631,1357,1357,1070,1070,1070,1070,1101,1583,1498,1498,1498,null,"A2F4",72.19,30.71,15.48,46.45]
[null,"SVI","Ministero dello Sviluppo Economico",null,1890,1890,1890,1890,1951,1830,1830,1491,1491,1491,1491,1452,1380,1258,1258,1258,null,"A2F3",72.19,30.71,15.48,46.45]
[null,"TRA","Ministero delle Infrastrutture e della Mobilità Sostenibile",null,317,317,317,317,869,1053,1053,904,904,904,904,967,1090,1063,1063,1063,null,"A2F2",72.19,30.71,15.48,46.45]
[null,"CUL","Ministero della Cultura",null,1048,1048,1048,1048,987,895,895,771,771,771,771,706,662,605,605,605,null,"A2F1",72.19,30.71,15.48,46.45]
[null,"TUR","Ministero del Turismo",null,1048,1048,1048,1048,987,895,895,771,771,771,771,706,662,605,605,605,null,"A1F3",53.68,19.09,11.02,33.049999999999997]
[null,"MEF","Ministero dell'Economia e delle Finanze",null,418,418,418,418,368,343,343,295,295,295,295,270,246,244,244,244,null,"A1F2",53.68,19.09,11.02,33.049999999999997]
[null,"GIU","Ministero della Giustizia",null,418,418,418,418,368,343,343,295,295,295,295,270,246,244,244,244,null,"A1F1",53.68,19.09,11.02,33.049999999999997]
[]
[]
[]
[null,null,"INDENNITA' AMMINISTRAZIONE MINISTERI: RICOGNIZIONE DEI VALORI A REGIME SULLA BASE DI QUANTO PREVISTO DAL DPCM 23/12/2021 E DAL CCNL COMPARTO FUNZIONI CENTRALI DEL 9/5/2022 (1)\nValori annuali in Euro da corrispondere per 12 mensilità (2) decorrenti dall' 1/11/2022, data di applicazione del nuovo sistema di classificazione professionale"]
[null,null,"MINISTERO",null,null,null,null,"NUOVA AREA"]
[null,null,null,null,null,null,null,"FUNZIONARI","ASSISTENTI","OPERATORI"]
[null,"AMB","Ministero Transizione ecologica",null,null,null,null,4528.68,3352.68,3040.32]
[null,"IST","Ministero Istruzione",null,null,null,null,4529.5200000000004,3352.8,3040.08]
[null,"URI","Ministero Università e Ricerca",null,null,null,null,4529.5200000000004,3352.8,3040.08]
[null,"AGR","Ministero delle Politiche Agricole Alimentari e Forestali",null,null,null,null,4529.5200000000004,3352.8,3040.08]
[null,"MAE","Ministero degli Affari Esteri e della Cooperazione Internazionale",null,null,null,null,4529.5200000000004,3352.8,3040.08]
[null,"SAL","Ministero della Salute",null,null,null,null,4529.5200000000004,3352.8,3040.08]
[null,"DIF","Ministero della Difesa",null,null,null,null,4638,3500.04,3040.32]
[null,"LAV","Ministero del Lavoro e delle Politiche Sociali",null,null,null,null,4529.5200000000004,3352.8,3040.08]
[null,"INT","Ministero dell'Interno",null,null,null,null,4554.72,3461.64,3028.08]
[null,"SVI","Ministero dello Sviluppo Economico",null,null,null,null,4528.68,3352.68,3040.32]
[null,"TRA","Ministero delle Infrastrutture e della Mobilità Sostenibile",null,null,null,null,4683.88,3462.4,3039.48]
[null,"CUL","Ministero della Cultura",null,null,null,null,4529.28,3352.08,3040.2]
[null,"TUR","Ministero del Turismo",null,null,null,null,4529.28,3352.08,3040.2]
[null,"MEF","Ministero dell'Economia e delle Finanze",null,null,null,null,5097.6000000000004,3635.76,3622.32]
[null,"GIU","Ministero della Giustizia",null,null,null,null,5097.6000000000004,3635.76,3622.32]
[null,"GIU","Ministero della Giustizia DAP e DGM (2)",null,null,null,null,4755.53,3514.42,3493.1]
[null,"DOG","Agenzia Dogane/Monopoli",null,null,null,null,8128.56,5731.08,5061]
[null,"DIG","Agenzia Italia Digitale",null,null,null,null,8128.56,5731.08,5061]
[null,"ENT","Agenzia Entrate",null,null,null,null,5623.32,3815.4,3324.72]
[null,"DEM","Agenzia Demanio",null,null,null,null,5623.32,3815.4,3324.72]
[]
[null,null,"(1)\nLa ricognizione di cui alla presente tabella è stata effettuata congiuntamente da Aran, Diparimento della Funzione pubblica e Ragioneria generale dello stato - IGOP per dare seguito a quanto previsto dalla dichiarazione congiunta n. 10 del CCNL del comparto Funzioni centrali sottoscritto il 9/5/2022"]
[]
[null,null,"(2)\nAi sensi dell’art. 34, comma 6 del CCNL 16/5/1995, i valori annuali dell’indennità di amministrazione per il personale del Dipartimento Amministrazione Penitenziaria e per il personale del Dipartimento per la giustizia minorile e di comunità del Ministero della Giustizia, destinatario della suddetta disposizione contrattuale, continuano ad essere corrisposti per tredici mensilità"]

{"sheet":"VACANZA CONTR.LE","index":6,"n_rows":300,"n_cols":28,"rows_kept":300,"cut":false,"hidden":true,"merged":[[1,24,1,27],[2,19,2,21],[206,11,207,13],[96,11,97,13],[118,11,119,13],[140,11,141,13],[151,11,152,13],[162,11,163,13],[184,11,185,13],[1,3,1,8],[19,11,20,13],[41,11,42,13],[52,11,53,13],[74,11,75,13],[228,11,229,13],[250,11,251,13],[272,11,273,13],[283,11,284,13],[294,11,295,13]]}
[]
[null,null,null,"VACANZA CONTRATTUALE",null,null,null,null,null,null,null,null,null,null,null,null,null,null,null,null,null,null,null,null,"IMPORTI MENSILI ESPRESSI IN €URO (LORDO CONTRIBUTIVO/PREVIDENZIALE)"]
[null,null,null,"DAL","AL","POS. ECON.","FASCE NELLE AREE","ANNUO LORDO","MENSILE LORDO","ANNUO LORDO","MENSILE LORDO",null,null,null,null,"IVC dal 1° luglio 2010",null,null,null,"TABELLA C",null,null,null,null,"AREA","FASCIA"," DAL 1° APRILE 2019 AL 30 GIUGNO 2019"," DAL 1° LUGLIO 2019 FINO AL RINNOVO CINTRATTUALE"]
[null,null,null,"A1","A1F1",null,null,null,null,null,null,null,null,null,"A3F7",229.86,null,null,null,"Indennità di vacanza contrattuale biennio 2010-11",null,null,null,null,"I","F1",6.04,10.07]
[null,{"$f":"CONCATENATE(G5,\" (\",F5,\") \",D5)","v":"A1F1 (A1) 35977"},null,"1998-07-01","1998-10-31","A1","A1F1",0,0,{"$f":"H5","v":0},{"$f":"J5","v":0},null,null,null,"A3F6",216.6,null,null,null,"Incrementi mensili della retribuzione tabellare",null,null,null,null,"I","F2",6.25,10.42]
[null,"A1F1 (A1) 36100",null,"1998-11-01","1999-05-31","A1","A1F1",0,0,{"$f":"H6","v":0},{"$f":"J6","v":0},null,null,null,"A3F5",202.81,null,null,null,"Valori in Euro da corrispondere per 13 mensilità",null,null,null,null,"I","F3",6.48,10.81]
[null,"A1F1 (A1) 36312",null,"1999-06-01","2000-06-30","A1","A1F1",0,0,0,0,null,null,null,"A3F4",190.41,null,null,null,null,null,null,null,null,"II","F1",6.37,10.62]
[null,"A1F1 (A1) 36708",null,"2000-07-01","2000-12-31","A1","A1F1",0,0,0,0,null,null,null,"A3F3",173.34,null,null,null,"Posizione economica","Dal 1.4.2010","Rideterminato dal 1.7.2010 (1)",null,null,"II","F2",6.7,11.16]
[null,"A1F1 (A1) 36892",null,"2001-01-01","2001-12-31","A1","A1F1",0,0,0,0,null,null,null,"A3F2",164.11,null,null,null,"Ispettore generale r.e",11.84,19.73,null,null,"II","F3",7.13,11.88]
[null,"A1F1 (A1) 37257",null,"2002-01-01","2002-12-31","A1","A1F1",0,0,0,0,null,null,null,"A3F1",158.44,null,null,null,"Direttore divisione r.e","11.00",18.329999999999998,null,null,"II","F4",7.56,12.6]
[null,"A1F1 (A1) 37622",null,"2003-01-01","2003-12-31","A1","A1F1",0,0,0,0,null,null,null,"A2F6",163.66999999999999,null,null,"A3F7","III F 7",11.49,19.16,null,null,"II","F5",7.83,13.05]
[null,"A1F1 (A1) 37987",null,"2004-01-01","2005-01-31","A1","A1F1",0,0,0,0,null,null,null,"A2F5",159.07,null,null,"A3F6","III F 6",10.83,18.05,null,null,"II","F6",8.06,13.43]
[null,"A1F1 (A1) 38384",null,"2005-02-01","2005-12-30","A1","A1F1",0,0,0,0,null,null,null,"A2F4",153.88,null,null,"A3F5","III F 5",10.14,16.899999999999999,null,null,"III","F1",7.8,13]
[null,"A1F1 (A1) 38717",null,"2005-12-31","2005-12-31","A1","A1F1",0,0,0,0,null,null,null,"A2F3",145.29,null,null,"A3F4","III F 4",9.52,15.87,null,null,"III","F2",8.08,13.46]
[null,"A1F1 (A1) 38718",null,"2006-01-01","2006-12-31","A1","A1F1",0,0,0,0,null,null,null,"A2F2",136.47999999999999,null,null,"A3F3","III F 3",8.67,14.45,null,null,"III","F3",8.52,14.19]
[null,"A1F1 (A1) 39083",null,"2007-01-01","2007-01-31","A1","A1F1",0,0,0,0," "," ",null,"A2F1",129.77000000000001,null,null,"A3F2","III F 2",8.2100000000000009,13.68,null,null,"III","F4",9.35,15.59]
[null,"A1F1 (A1) 39114",null,"2007-02-01","2007-12-31","A1","A1F1",0,0,0,0,null," ",null,"A1F3",132,null,null,"A3F1","III F 1",7.92,13.2,null,null,"III","F5",9.9600000000000009,16.600000000000001]
[null,"A1F1 (A1) 39448",null,"2008-01-01","2008-12-31","A1","A1F1",0,0,0,0,null,null,null,"A1F2",127.3,null,null,"A2F6","II F 6",8.18,13.64,null,null,"III","F6",10.63,17.72]
[null,"A1F1 (A1) 39814",null,"2009-01-01","2010-03-31","A1","A1F1",0,0,0,0,null,null,null,"A1F1",122.88," ",null,"A2F5","II F 5",7.95,13.26,null,null,"III","F7",11.29,18.809999999999999]
[null,"A1F1 (A1) 40269",null,"2010-04-01","2010-06-30","A1","A1F1",{"$f":"ROUND(I20*12,2)","v":73.680000000000007},{"$f":"K20","v":6.14},73.680000000000007,6.14,"ind.vacanza contrattuale ",null,null,null,null,null,null,"A2F4","II F 4",7.69,12.82]
[null,"A1F1 (A1) 40360",null,"2010-07-01","2018-03-31","A1","A1F1",{"$f":"ROUND(I21*12,2)","v":122.88},{"$f":"K21","v":10.24},{"$f":"VLOOKUP(G21,$O$4:$P$19,2,FALSE)","v":122.88},10.24,null,null,null,null,null,null,null,"A2F3","II F 3",7.26,12.11]
[null,"A1F1 (A1) 43191",null,"2018-04-01","2019-03-31",{"$f":"F21","v":"A1"},{"$f":"G21","v":"A1F1"},0,0,{"$f":"H22","v":0},{"$f":"EXACT(H21,J21)","v":true},null,null,null,null,null,null,null,"A2F2","II F 2",6.82,11.37]
[null,"A1F1 (A1) 44652",null,"2022-04-01","2022-06-30",{"$f":"F22","v":"A1"},"A1F1",{"$f":"VLOOKUP(G23,'CCNL 2019-2021'!$C$32:$J$47,3,FALSE)","v":54.06},{"$f":"VLOOKUP(G23,'CCNL 2019-2021'!$C$32:$J$47,6,FALSE)","v":4.51},{"$f":"H23","v":54.06},null,null,null,null,null,null,null,null,"A2F1","II F 1",6.49,10.81]
[null,"A1F1 (A1) 44743",null,"2022-07-01","2023-12-31","A1","A1F1",{"$f":"VLOOKUP(G23,'CCNL 2019-2021'!$C$32:$J$47,4,FALSE)","v":91.22},{"$f":"VLOOKUP(G23,'CCNL 2019-2021'!$C$32:$J$47,7,FALSE)","v":7.6},91.22,null,null,null,null,null,null,null,null,"A1F3","I F 3",6.6,11]
[null,"A1F1 (A1) 45292",null,"2024-01-01","9999-01-01","A1","A1F1",{"$f":"VLOOKUP(G24,'CCNL 2019-2021'!$C$32:$J$47,5,FALSE)+H24","v":702.26},{"$f":"VLOOKUP(G24,'CCNL 2019-2021'!$C$32:$J$47,8,FALSE)+I24","v":58.52},702.26,null,null,null,null,null,null,null,null,"A1F2","I F 2",6.36,10.61]
[null,null,null,"A1S","A1F2",null,null,null,null,null,null,null," ",null,null,null,null,null,"A1F1","I F 1",6.14,10.24]
[null,{"$f":"CONCATENATE(G27,\" (\",F27,\") \",D27)","v":"A1F2 (A1S) 35977"},null,"1998-07-01","1998-10-31","A1S","A1F2",0,0,{"$f":"H27","v":0},{"$f":"J27","v":0}]
[null,"A1F2 (A1S) 36100",null,"1998-11-01","1999-05-31","A1S","A1F2",0,0,0,0]
[null,"A1F2 (A1S) 36312",null,"1999-06-01","2000-06-30","A1S","A1F2",0,0,0,0]
[null,"A1F2 (A1S) 36708",null,"2000-07-01","2000-12-31","A1S","A1F2",0,0,0,0," "]
[null,"A1F2 (A1S) 36892",null,"2001-01-01","2001-12-31","A1S","A1F2",0,0,0,0,null,null,null,null,null," "]
[null,"A1F2 (A1S) 37257",null,"2002-01-01","2002-12-31","A1S","A1F2",0,0,0,0,null,null," "," "]
[null,"A1F2 (A1S) 37622",null,"2003-01-01","2003-12-31","A1S","A1F2",0,0,0,0,null,null," "]
[null,"A1F2 (A1S) 37987",null,"2004-01-01","2005-01-31","A1S","A1F2",0,0,0,0]
[null,"A1F2 (A1S) 38384",null,"2005-02-01","2005-12-30","A1S","A1F2",0,0,0,0,null,null," "]
[null,"A1F2 (A1S) 38717",null,"2005-12-31","2005-12-31","A1S","A1F2",0,0,0,0]
[null,"A1F2 (A1S) 38718",null,"2006-01-01","2006-12-31","A1S","A1F2",0,0,0,0," "]
[null,"A1F2 (A1S) 39083",null,"2007-01-01","2007-01-31","A1S","A1F2",0,0,0,0]
[null,"A1F2 (A1S) 39114",null,"2007-02-01","2007-12-31","A1S","A1F2",0,0,0,0," "]
[null,"A1F2 (A1S) 39448",null,"2008-01-01","2008-12-31","A1S","A1F2",0,0,0,0]
[null,"A1F2 (A1S) 39814",null,"2009-01-01","2010-03-31","A1S","A1F2",0,0,0,0]
[null,"A1F2 (A1S) 40269",null,"2010-04-01","2010-06-30","A1S","A1F2",{"$f":"ROUND(I42*12,2)","v":76.319999999999993},{"$f":"K42","v":6.36},76.319999999999993,6.36,"ind.vacanza contrattuale "]
[null,"A1F2 (A1S) 40360",null,"2010-07-01","2018-03-31","A1S","A1F2",{"$f":"ROUND(I43*12,2)","v":127.32},{"$f":"K43","v":10.61},{"$f":"VLOOKUP(G43,$O$4:$P$19,2,FALSE)","v":127.3},10.61]
[null,"A1F2 (A1S) 43191",null,"2018-04-01","2019-03-31",{"$f":"F43","v":"A1S"},{"$f":"G43","v":"A1F2"},0,0,{"$f":"H44","v":0},{"$f":"EXACT(H43,J43)","v":false}]
[null,"A1F2 (A1S) 44652",null,"2022-04-01","2022-06-30",{"$f":"F44","v":"A1S"},"A1F2",{"$f":"VLOOKUP(G45,'CCNL 2019-2021'!$C$32:$J$47,3,FALSE)","v":55.91},{"$f":"VLOOKUP(G45,'CCNL 2019-2021'!$C$32:$J$47,6,FALSE)","v":4.66},{"$f":"H45","v":55.91}]
[null,"A1F2 (A1S) 44743",null,"2022-07-01","2023-12-31","A1S","A1F2",{"$f":"VLOOKUP(G45,'CCNL 2019-2021'!$C$32:$J$47,4,FALSE)","v":94.32},{"$f":"VLOOKUP(G45,'CCNL 2019-2021'!$C$32:$J$47,7,FALSE)","v":7.86},94.32]
[null,"A1F2 (A1S) 45292",null,"2024-01-01","9999-01-01","A1S","A1F2",{"$f":"VLOOKUP(G46,'CCNL 2019-2021'!$C$32:$J$47,5,FALSE)+H46","v":726.27},{"$f":"VLOOKUP(G46,'CCNL 2019-2021'!$C$32:$J$47,8,FALSE)+I46","v":60.519999999999996},726.27]
[null,null,null,"--------","A1F3"]
[null,{"$f":"CONCATENATE(G49,\" \",D49)","v":"A1F3 36100"},null,"1998-11-01","2007-12-30","--------","A1F3",0,0,{"$f":"H49","v":0},{"$f":"J49","v":0}]
[null,"A1F3 39447",null,"2007-12-31","2007-12-31","--------","A1F3",0,0,0,0]
[null,"A1F3 39448",null,"2008-01-01","2008-12-31","--------","A1F3",0,0,0,0]
[null,"A1F3 39814",null,"2009-01-01","2010-03-31","--------","A1F3",0,0,0,0]
[null,"A1F3 40269",null,"2010-04-01","2010-06-30","--------","A1F3",{"$f":"ROUND(I53*12,2)","v":79.2},{"$f":"K53","v":6.6},79.2,6.6,"ind.vacanza contrattuale "]
[null,"A1F3 40360",null,"2010-07-01","2018-03-31","--------","A1F3",{"$f":"ROUND(I54*12,2)","v":132},{"$f":"K54","v":11},{"$f":"VLOOKUP(G54,$O$4:$P$19,2,FALSE)","v":132},11]
[null,"A1F3 43191",null,"2018-04-01","2019-03-31",{"$f":"F54","v":"--------"},{"$f":"G54","v":"A1F3"},0,0,{"$f":"H55","v":0},{"$f":"EXACT(H54,J54)","v":true}]
[null,"A1F3 44652",null,"2022-04-01","2022-06-30",{"$f":"F55","v":"--------"},"A1F3",{"$f":"VLOOKUP(G56,'CCNL 2019-2021'!$C$32:$J$47,3,FALSE)","v":57.95},{"$f":"VLOOKUP(G56,'CCNL 2019-2021'!$C$32:$J$47,6,FALSE)","v":4.83},{"$f":"H56","v":57.95}]
[null,"A1F3 44743",null,"2022-07-01","2023-12-31","--------","A1F3",{"$f":"VLOOKUP(G56,'CCNL 2019-2021'!$C$32:$J$47,4,FALSE)","v":97.75},{"$f":"VLOOKUP(G56,'CCNL 2019-2021'!$C$32:$J$47,7,FALSE)","v":8.15},97.75]
[null,"A1F3 45292",null,"2024-01-01","9999-01-01","--------","A1F3",{"$f":"VLOOKUP(G57,'CCNL 2019-2021'!$C$32:$J$47,5,FALSE)+H57","v":753.01},{"$f":"VLOOKUP(G57,'CCNL 2019-2021'!$C$32:$J$47,8,FALSE)+I57","v":62.76},753.01]
[null,null,null,"B1","A2F1"]
[null,{"$f":"CONCATENATE(G60,\" (\",F60,\") \",D60)","v":"A2F1 (B1) 35977"},null,"1998-07-01","1998-10-31","B1","A2F1",0,0,{"$f":"H60","v":0},{"$f":"J60","v":0}]
[null,"A2F1 (B1) 36100",null,"1998-11-01","1999-05-31","B1","A2F1",0,0,0,0]
[null,"A2F1 (B1) 36312",null,"1999-06-01","2000-06-30","B1","A2F1",0,0,0,0]
[null,"A2F1 (B1) 36708",null,"2000-07-01","2000-12-31","B1","A2F1",0,0,0,0]
[null,"A2F1 (B1) 36892",null,"2001-01-01","2001-12-31","B1","A2F1",0,0,0,0]
[null,"A2F1 (B1) 37257",null,"2002-01-01","2002-12-31","B1","A2F1",0,0,0,0]
[null,"A2F1 (B1) 37622",null,"2003-01-01","2003-12-31","B1","A2F1",0,0,0,0]
[null,"A2F1 (B1) 37987",null,"2004-01-01","2005-01-31","B1","A2F1",0,0,0,0,null,null,null,null,null," "]
[null,"A2F1 (B1) 38384",null,"2005-02-01","2005-12-30","B1","A2F1",0,0,0,0]
[null,"A2F1 (B1) 38717",null,"2005-12-31","2005-12-31","B1","A2F1",0,0,0,0]
[null,"A2F1 (B1) 38718",null,"2006-01-01","2006-12-31","B1","A2F1",0,0,0,0," "]
[null,"A2F1 (B1) 39083",null,"2007-01-01","2007-01-31","B1","A2F1",0,0,0,0]
[null,"A2F1 (B1) 39114",null,"2007-02-01","2007-12-31","B1","A2F1",0,0,0,0]
[null,"A2F1 (B1) 39448",null,"2008-01-01","2008-12-31","B1","A2F1",0,0,0,0]
[null,"A2F1 (B1) 39814",null,"2009-01-01","2010-03-31","B1","A2F1",0,0,0,0]
[null,"A2F1 (B1) 40269",null,"2010-04-01","2010-06-30","B1","A2F1",{"$f":"ROUND(I75*12,2)","v":77.88},{"$f":"K75","v":6.49},77.88,6.49,"ind.vacanza contrattuale "]
[null,"A2F1 (B1) 40360",null,"2010-07-01","2018-03-31","B1","A2F1",{"$f":"ROUND(I76*12,2)","v":129.72},{"$f":"K76","v":10.81},{"$f":"VLOOKUP(G76,$O$4:$P$19,2,FALSE)","v":129.77000000000001},10.81]
[null,"A2F1 (B1) 43191",null,"2018-04-01","2019-03-31",{"$f":"F76","v":"B1"},{"$f":"G76","v":"A2F1"},0,0,{"$f":"H77","v":0},{"$f":"EXACT(H76,J76)","v":false}]
[null,"A2F1 (B1) 44652",null,"2022-04-01","2022-06-30",{"$f":"F77","v":"B1"},"A2F1",{"$f":"VLOOKUP(G78,'CCNL 2019-2021'!$C$32:$J$47,3,FALSE)","v":56.92},{"$f":"VLOOKUP(G78,'CCNL 2019-2021'!$C$32:$J$47,6,FALSE)","v":4.74},{"$f":"H78","v":56.92}]
[null,"A2F1 (B1) 44743",null,"2022-07-01","2023-12-31","B1","A2F1",{"$f":"VLOOKUP(G78,'CCNL 2019-2021'!$C$32:$J$47,4,FALSE)","v":96.01},{"$f":"VLOOKUP(G78,'CCNL 2019-2021'!$C$32:$J$47,7,FALSE)","v":8},96.01]
[null,"A2F1 (B1) 45292",null,"2024-01-01","9999-01-01","B1","A2F1",{"$f":"VLOOKUP(G79,'CCNL 2019-2021'!$C$32:$J$47,5,FALSE)+H79","v":739.21},{"$f":"VLOOKUP(G79,'CCNL 2019-2021'!$C$32:$J$47,8,FALSE)+I79","v":61.6},739.21]
[null,null,null,"B2","A2F2"]
[null,{"$f":"CONCATENATE(G82,\" (\",F82,\") \",D82)","v":"A2F2 (B2) 35977"},null,"1998-07-01","1998-10-31","B2","A2F2",0,0,{"$f":"H82","v":0},{"$f":"J82","v":0}]
[null,"A2F2 (B2) 36100",null,"1998-11-01","1999-05-31","B2","A2F2",0,0,0,0]
[null,"A2F2 (B2) 36312",null,"1999-06-01","2000-06-30","B2","A2F2",0,0,0,0]
[null,"A2F2 (B2) 36708",null,"2000-07-01","2000-12-31","B2","A2F2",0,0,0,0]
[null,"A2F2 (B2) 36892",null,"2001-01-01","2001-12-31","B2","A2F2",0,0,0,0]
[null,"A2F2 (B2) 37257",null,"2002-01-01","2002-12-31","B2","A2F2",0,0,0,0]
[null,"A2F2 (B2) 37622",null,"2003-01-01","2003-12-31","B2","A2F2",0,0,0,0]
[null,"A2F2 (B2) 37987",null,"2004-01-01","2005-01-31","B2","A2F2",0,0,0,0]
[null,"A2F2 (B2) 38384",null,"2005-02-01","2005-12-30","B2","A2F2",0,0,0,0]
[null,"A2F2 (B2) 38717",null,"2005-12-31","2005-12-31","B2","A2F2",0,0,0,0]
[null,"A2F2 (B2) 38718",null,"2006-01-01","2006-12-31","B2","A2F2",0,0,0,0]
[null,"A2F2 (B2) 39083",null,"2007-01-01","2007-01-31","B2","A2F2",0,0,0,0]
[null,"A2F2 (B2) 39114",null,"2007-02-01","2007-12-31","B2","A2F2",0,0,0,0]
[null,"A2F2 (B2) 39448",null,"2008-01-01","2008-12-31","B2","A2F2",0,0,0,0]
[null,"A2F2 (B2) 39814",null,"2009-01-01","2010-03-31","B2","A2F2",0,0,0,0]
[null,"A2F2 (B2) 40269",null,"2010-04-01","2010-06-30","B2","A2F2",{"$f":"ROUND(I97*12,2)","v":81.84},{"$f":"K97","v":6.82},81.84,6.82,"ind.vacanza contrattuale "]
[null,"A2F2 (B2) 40360",null,"2010-07-01","2018-03-31","B2","A2F2",{"$f":"ROUND(I98*12,2)","v":136.44},{"$f":"K98","v":11.37},{"$f":"VLOOKUP(G98,$O$4:$P$19,2,FALSE)","v":136.47999999999999},11.37]
[null,"A2F2 (B2) 43191",null,"2018-04-01","2019-03-31",{"$f":"F98","v":"B2"},{"$f":"G98","v":"A2F2"},0,0,{"$f":"H99","v":0},{"$f":"EXACT(H98,J98)","v":false}]
[null,"A2F2 (B2) 44652",null,"2022-04-01","2022-06-30",{"$f":"F99","v":"B2"},"A2F2",{"$f":"VLOOKUP(G100,'CCNL 2019-2021'!$C$32:$J$47,3,FALSE)","v":59.79},{"$f":"VLOOKUP(G100,'CCNL 2019-2021'!$C$32:$J$47,6,FALSE)","v":4.9800000000000004},{"$f":"H100","v":59.79}]
[null,"A2F2 (B2) 44743",null,"2022-07-01","2023-12-31","B2","A2F2",{"$f":"VLOOKUP(G100,'CCNL 2019-2021'!$C$32:$J$47,4,FALSE)","v":100.84},{"$f":"VLOOKUP(G100,'CCNL 2019-2021'!$C$32:$J$47,7,FALSE)","v":8.4},100.84]
[null,"A2F2 (B2) 45292",null,"2024-01-01","9999-01-01","B2","A2F2",{"$f":"VLOOKUP(G101,'CCNL 2019-2021'!$C$32:$J$47,5,FALSE)+H101","v":776.2},{"$f":"VLOOKUP(G101,'CCNL 2019-2021'!$C$32:$J$47,8,FALSE)+I101","v":64.680000000000007},776.2]
[null,null,null,"B3","A2F3",null,null,null,null,null,null,null," "]
[null,{"$f":"CONCATENATE(G104,\" (\",F104,\") \",D104)","v":"A2F3 (B3) 35977"},null,"1998-07-01","1998-10-31","B3","A2F3",0,0,{"$f":"H104","v":0},{"$f":"J104","v":0}]
[null,"A2F3 (B3) 36100",null,"1998-11-01","1999-05-31","B3","A2F3",0,0,0,0]
[null,"A2F3 (B3) 36312",null,"1999-06-01","2000-06-30","B3","A2F3",0,0,0,0]
[null,"A2F3 (B3) 36708",null,"2000-07-01","2000-12-31","B3","A2F3",0,0,0,0]
[null,"A2F3 (B3) 36892",null,"2001-01-01","2001-12-31","B3","A2F3",0,0,0,0]
[null,"A2F3 (B3) 37257",null,"2002-01-01","2002-12-31","B3","A2F3",0,0,0,0]
[null,"A2F3 (B3) 37622",null,"2003-01-01","2003-12-31","B3","A2F3",0,0,0,0]
[null,"A2F3 (B3) 37987",null,"2004-01-01","2005-01-31","B3","A2F3",0,0,0,0]
[null,"A2F3 (B3) 38384",null,"2005-02-01","2005-12-30","B3","A2F3",0,0,0,0]
[null,"A2F3 (B3) 38717",null,"2005-12-31","2005-12-31","B3","A2F3",0,0,0,0]
[null,"A2F3 (B3) 38718",null,"2006-01-01","2006-12-31","B3","A2F3",0,0,0,0]
[null,"A2F3 (B3) 39083",null,"2007-01-01","2007-01-31","B3","A2F3",0,0,0,0]
[null,"A2F3 (B3) 39114",null,"2007-02-01","2007-12-31","B3","A2F3",0,0,0,0]
[null,"A2F3 (B3) 39448",null,"2008-01-01","2008-12-31","B3","A2F3",0,0,0,0]
[null,"A2F3 (B3) 39814",null,"2009-01-01","2010-03-31","B3","A2F3",0,0,0,0]
[null,"A2F3 (B3) 40269",null,"2010-04-01","2010-06-30","B3","A2F3",{"$f":"ROUND(I119*12,2)","v":87.12},{"$f":"K119","v":7.26},87.12,7.26,"ind.vacanza contrattuale "]
[null,"A2F3 (B3) 40360",null,"2010-07-01","2018-03-31","B3","A2F3",{"$f":"ROUND(I120*12,2)","v":145.32},{"$f":"K120","v":12.11},{"$f":"VLOOKUP(G120,$O$4:$P$19,2,FALSE)","v":145.29},12.11]
[null,"A2F3 (B3) 43191",null,"2018-04-01","2019-03-31",{"$f":"F120","v":"B3"},{"$f":"G120","v":"A2F3"},0,0,{"$f":"H121","v":0},{"$f":"EXACT(H120,J120)","v":false}]
[null,"A2F3 (B3) 44652",null,"2022-04-01","2022-06-30",{"$f":"F121","v":"B3"},"A2F3",{"$f":"VLOOKUP(G122,'CCNL 2019-2021'!$C$32:$J$47,3,FALSE)","v":63.6},{"$f":"VLOOKUP(G122,'CCNL 2019-2021'!$C$32:$J$47,6,FALSE)","v":5.3},{"$f":"H122","v":63.6}]
[null,"A2F3 (B3) 44743",null,"2022-07-01","2023-12-31","B3","A2F3",{"$f":"VLOOKUP(G122,'CCNL 2019-2021'!$C$32:$J$47,4,FALSE)","v":107.25},{"$f":"VLOOKUP(G122,'CCNL 2019-2021'!$C$32:$J$47,7,FALSE)","v":8.94},107.25]
[null,"A2F3 (B3) 45292",null,"2024-01-01","9999-01-01","B3","A2F3",{"$f":"VLOOKUP(G123,'CCNL 2019-2021'!$C$32:$J$47,5,FALSE)+H123","v":826.02},{"$f":"VLOOKUP(G123,'CCNL 2019-2021'!$C$32:$J$47,8,FALSE)+I123","v":68.84},826.02]
[null,null,null,"B3S","A2F4"]
[null,{"$f":"CONCATENATE(G126,\" (\",F126,\") \",D126)","v":"A2F4 (B3S) 35977"},null,"1998-07-01","1998-10-31","B3S","A2F4",0,0,{"$f":"H126","v":0},{"$f":"J126","v":0}]
[null,"A2F4 (B3S) 36100",null,"1998-11-01","1999-05-31","B3S","A2F4",0,0,0,0]
[null,"A2F4 (B3S) 36312",null,"1999-06-01","2000-06-30","B3S","A2F4",0,0,0,0]
[null,"A2F4 (B3S) 36708",null,"2000-07-01","2000-12-31","B3S","A2F4",0,0,0,0]
[null,"A2F4 (B3S) 36892",null,"2001-01-01","2001-12-31","B3S","A2F4",0,0,0,0]
[null,"A2F4 (B3S) 37257",null,"2002-01-01","2002-12-31","B3S","A2F4",0,0,0,0]
[null,"A2F4 (B3S) 37622",null,"2003-01-01","2003-12-31","B3S","A2F4",0,0,0,0]
[null,"A2F4 (B3S) 37987",null,"2004-01-01","2005-01-31","B3S","A2F4",0,0,0,0]
[null,"A2F4 (B3S) 38384",null,"2005-02-01","2005-12-30","B3S","A2F4",0,0,0,0]
[null,"A2F4 (B3S) 38717",null,"2005-12-31","2005-12-31","B3S","A2F4",0,0,0,0,null," "]
[null,"A2F4 (B3S) 38718",null,"2006-01-01","2006-12-31","B3S","A2F4",0,0,0,0]
[null,"A2F4 (B3S) 39083",null,"2007-01-01","2007-01-31","B3S","A2F4",0,0,0,0]
[null,"A2F4 (B3S) 39114",null,"2007-02-01","2007-12-31","B3S","A2F4",0,0,0,0]
[null,"A2F4 (B3S) 39448",null,"2008-01-01","2008-12-31","B3S","A2F4",0,0,0,0]
[null,"A2F4 (B3S) 39814",null,"2009-01-01","2010-03-31","B3S","A2F4",0,0,0,0]
[null,"A2F4 (B3S) 40269",null,"2010-04-01","2010-06-30","B3S","A2F4",{"$f":"ROUND(I141*12,2)","v":92.28},{"$f":"K141","v":7.69},92.28,7.69,"ind.vacanza contrattuale "]
[null,"A2F4 (B3S) 40360",null,"2010-07-01","2018-03-31","B3S","A2F4",{"$f":"ROUND(I142*12,2)","v":153.84},{"$f":"K142","v":12.82},{"$f":"VLOOKUP(G142,$O$4:$P$19,2,FALSE)","v":153.88},12.82]
[null,"A2F4 (B3S) 43191",null,"2018-04-01","2019-03-31",{"$f":"F142","v":"B3S"},{"$f":"G142","v":"A2F4"},0,0,{"$f":"H143","v":0},{"$f":"EXACT(H142,J142)","v":false}]
[null,"A2F4 (B3S) 44652",null,"2022-04-01","2022-06-30",{"$f":"F143","v":"B3S"},"A2F4",{"$f":"VLOOKUP(G144,'CCNL 2019-2021'!$C$32:$J$47,3,FALSE)","v":67.56},{"$f":"VLOOKUP(G144,'CCNL 2019-2021'!$C$32:$J$47,6,FALSE)","v":5.63},{"$f":"H144","v":67.56}]
[null,"A2F4 (B3S) 44743",null,"2022-07-01","2023-12-31","B3S","A2F4",{"$f":"VLOOKUP(G144,'CCNL 2019-2021'!$C$32:$J$47,4,FALSE)","v":113.97},{"$f":"VLOOKUP(G144,'CCNL 2019-2021'!$C$32:$J$47,7,FALSE)","v":9.5},113.97]
[null,"A2F4 (B3S) 45292",null,"2024-01-01","9999-01-01","B3S","A2F4",{"$f":"VLOOKUP(G145,'CCNL 2019-2021'!$C$32:$J$47,5,FALSE)+H145","v":877.77},{"$f":"VLOOKUP(G145,'CCNL 2019-2021'!$C$32:$J$47,8,FALSE)+I145","v":73.150000000000006},877.77]
[null,null,null,"--------","A2F5"]
[null,{"$f":"CONCATENATE(G148,\" \",D148)","v":"A2F5 36100"},null,"1998-11-01","2007-12-30","--------","A2F5",0,0,{"$f":"H148","v":0},{"$f":"J148","v":0}]
[null,"A2F5 39417",null,"2007-12-01","2007-12-31","--------","A2F5",0,0,0,0]
[null,"A2F5 39448",null,"2008-01-01","2008-12-31","--------","A2F5",0,0,0,0]
[null,"A2F5 39814",null,"2009-01-01","2010-03-31","--------","A2F5",0,0,0,0]
[null,"A2F5 40269",null,"2010-04-01","2010-06-30","--------","A2F5",{"$f":"ROUND(I152*12,2)","v":95.4},{"$f":"K152","v":7.95},95.4,7.95,"ind.vacanza contrattuale "]
[null,"A2F5 40360",null,"2010-07-01","2018-03-31","--------","A2F5",{"$f":"ROUND(I153*12,2)","v":159.12},{"$f":"K153","v":13.26},{"$f":"VLOOKUP(G153,$O$4:$P$19,2,FALSE)","v":159.07},13.26]
[null,"A2F5 43191",null,"2018-04-01","2019-03-31",{"$f":"F153","v":"--------"},{"$f":"G153","v":"A2F5"},0,0,{"$f":"H154","v":0},{"$f":"EXACT(H153,J153)","v":false}]
[null,"A2F5 44652",null,"2022-04-01","2022-06-30",{"$f":"F154","v":"--------"},"A2F5",{"$f":"VLOOKUP(G155,'CCNL 2019-2021'!$C$32:$J$47,3,FALSE)","v":70.16},{"$f":"VLOOKUP(G155,'CCNL 2019-2021'!$C$32:$J$47,6,FALSE)","v":5.85},{"$f":"H155","v":70.16}]
[null,"A2F5 44743",null,"2022-07-01","2023-12-31","--------","A2F5",{"$f":"VLOOKUP(G155,'CCNL 2019-2021'!$C$32:$J$47,4,FALSE)","v":116.93},{"$f":"VLOOKUP(G155,'CCNL 2019-2021'!$C$32:$J$47,7,FALSE)","v":9.74},116.93]
[null,"A2F5 45292",null,"2024-01-01","9999-01-01","--------","A2F5",{"$f":"VLOOKUP(G156,'CCNL 2019-2021'!$C$32:$J$47,5,FALSE)+H156","v":900.02},{"$f":"VLOOKUP(G156,'CCNL 2019-2021'!$C$32:$J$47,8,FALSE)+I156","v":75},900.02]
[null,null,null,"--------","A2F6"]
[null,{"$f":"CONCATENATE(G159,\" \",D159)","v":"A2F6 36100"},null,"1998-11-01","2007-12-30","--------","A2F6",0,0,{"$f":"H159","v":0},{"$f":"J159","v":0}]
[null,"A2F6 39447",null,"2007-12-31","2007-12-31","--------","A2F6",0,0,0,0]
[null,"A2F6 39448",null,"2008-01-01","2008-12-31","--------","A2F6",0,0,0,0," "]
[null,"A2F6 39814",null,"2009-01-01","2010-03-31","--------","A2F6",0,0,0,0]
[null,"A2F6 40269",null,"2010-04-01","2010-06-30","--------","A2F6",{"$f":"ROUND(I163*12,2)","v":98.16},{"$f":"K163","v":8.18},98.16,8.18,"ind.vacanza contrattuale "]
[null,"A2F6 40360",null,"2010-07-01","2018-03-31","--------","A2F6",{"$f":"ROUND(I164*12,2)","v":163.68},{"$f":"K164","v":13.64},{"$f":"VLOOKUP(G164,$O$4:$P$19,2,FALSE)","v":163.66999999999999},13.64]
[null,"A2F6 43191",null,"2018-04-01","2019-03-31",{"$f":"F164","v":"--------"},{"$f":"G164","v":"A2F6"},0,0,{"$f":"H165","v":0},{"$f":"EXACT(H164,J164)","v":false}]
[null,"A2F6 44652",null,"2022-04-01","2022-06-30",{"$f":"F165","v":"--------"},"A2F6",{"$f":"VLOOKUP(G166,'CCNL 2019-2021'!$C$32:$J$47,3,FALSE)","v":72.13},{"$f":"VLOOKUP(G166,'CCNL 2019-2021'!$C$32:$J$47,6,FALSE)","v":6.01},{"$f":"H166","v":72.13}]
[null,"A2F6 44743",null,"2022-07-01","2023-12-31","--------","A2F6",{"$f":"VLOOKUP(G166,'CCNL 2019-2021'!$C$32:$J$47,4,FALSE)","v":120.22},{"$f":"VLOOKUP(G166,'CCNL 2019-2021'!$C$32:$J$47,7,FALSE)","v":10.02},120.22]
[null,"A2F6 45292",null,"2024-01-01","9999-01-01","--------","A2F6",{"$f":"VLOOKUP(G167,'CCNL 2019-2021'!$C$32:$J$47,5,FALSE)+H167","v":925.83},{"$f":"VLOOKUP(G167,'CCNL 2019-2021'!$C$32:$J$47,8,FALSE)+I167","v":77.149999999999991},925.83]
[null,null,null,"C1","A3F1"]
[null,{"$f":"CONCATENATE(G170,\" (\",F170,\") \",D170)","v":"A3F1 (C1) 35977"},null,"1998-07-01","1998-10-31","C1","A3F1",0,0,{"$f":"H170","v":0},{"$f":"J170","v":0}]
[null,"A3F1 (C1) 36100",null,"1998-11-01","1999-05-31","C1","A3F1",0,0,0,0]
[null,"A3F1 (C1) 36312",null,"1999-06-01","2000-06-30","C1","A3F1",0,0,0,0]
[null,"A3F1 (C1) 36708",null,"2000-07-01","2000-12-31","C1","A3F1",0,0,0,0]
[null,"A3F1 (C1) 36892",null,"2001-01-01","2001-12-31","C1","A3F1",0,0,0,0]
[null,"A3F1 (C1) 37257",null,"2002-01-01","2002-12-31","C1","A3F1",0,0,0,0]
[null,"A3F1 (C1) 37622",null,"2003-01-01","2003-12-31","C1","A3F1",0,0,0,0]
[null,"A3F1 (C1) 37987",null,"2004-01-01","2005-01-31","C1","A3F1",0,0,0,0]
[null,"A3F1 (C1) 38384",null,"2005-02-01","2005-12-30","C1","A3F1",0,0,0,0]
[null,"A3F1 (C1) 38717",null,"2005-12-31","2005-12-31","C1","A3F1",0,0,0,0]
[null,"A3F1 (C1) 38718",null,"2006-01-01","2006-12-31","C1","A3F1",0,0,0,0]
[null,"A3F1 (C1) 39083",null,"2007-01-01","2007-01-31","C1","A3F1",0,0,0,0]
[null,"A3F1 (C1) 39114",null,"2007-02-01","2007-12-31","C1","A3F1",0,0,0,0]
[null,"A3F1 (C1) 39448",null,"2008-01-01","2008-12-31","C1","A3F1",0,0,0,0]
[null,"A3F1 (C1) 39814",null,"2009-01-01","2010-03-31","C1","A3F1",0,0,0,0]
[null,"A3F1 (C1) 40269",null,"2010-04-01","2010-06-30","C1","A3F1",{"$f":"ROUND(I185*12,2)","v":95.04},{"$f":"K185","v":7.92},95.04,7.92,"ind.vacanza contrattuale "]
[null,"A3F1 (C1) 40360",null,"2010-07-01","2018-03-31","C1","A3F1",{"$f":"ROUND(I186*12,2)","v":158.4},{"$f":"K186","v":13.2},{"$f":"VLOOKUP(G186,$O$4:$P$19,2,FALSE)","v":158.44},13.2]
[null,"A3F1 (C1) 43191",null,"2018-04-01","2019-03-31",{"$f":"F186","v":"C1"},{"$f":"G186","v":"A3F1"},0,0,{"$f":"H187","v":0},{"$f":"EXACT(H186,J186)","v":false}]
[null,"A3F1 (C1) 44652",null,"2022-04-01","2022-06-30",{"$f":"F187","v":"C1"},"A3F1",{"$f":"VLOOKUP(G188,'CCNL 2019-2021'!$C$32:$J$47,3,FALSE)","v":69.900000000000006},{"$f":"VLOOKUP(G188,'CCNL 2019-2021'!$C$32:$J$47,6,FALSE)","v":5.83},{"$f":"H188","v":69.900000000000006}]
[null,"A3F1 (C1) 44743",null,"2022-07-01","2023-12-31","C1","A3F1",{"$f":"VLOOKUP(G188,'CCNL 2019-2021'!$C$32:$J$47,4,FALSE)","v":116.5},{"$f":"VLOOKUP(G188,'CCNL 2019-2021'!$C$32:$J$47,7,FALSE)","v":9.7100000000000009},116.5]
[null,"A3F1 (C1) 45292",null,"2024-01-01","9999-01-01","C1","A3F1",{"$f":"VLOOKUP(G189,'CCNL 2019-2021'!$C$32:$J$47,5,FALSE)+H189","v":897.18},{"$f":"VLOOKUP(G189,'CCNL 2019-2021'!$C$32:$J$47,8,FALSE)+I189","v":74.77000000000001},897.18]
[null,null,null,"C1S","A3F2"]
[null,{"$f":"CONCATENATE(G192,\" (\",F192,\") \",D192)","v":"A3F2 (C1S) 35977"},null,"1998-07-01","1998-10-31","C1S","A3F2",0,0,{"$f":"H192","v":0},{"$f":"J192","v":0}]
[null,"A3F2 (C1S) 36100",null,"1998-11-01","1999-05-31","C1S","A3F2",0,0,0,0]
[null,"A3F2 (C1S) 36312",null,"1999-06-01","2000-06-30","C1S","A3F2",0,0,0,0]
[null,"A3F2 (C1S) 36708",null,"2000-07-01","2000-12-31","C1S","A3F2",0,0,0,0]
[null,"A3F2 (C1S) 36892",null,"2001-01-01","2001-12-31","C1S","A3F2",0,0,0,0]
[null,"A3F2 (C1S) 37257",null,"2002-01-01","2002-12-31","C1S","A3F2",0,0,0,0,null," "]
[null,"A3F2 (C1S) 37622",null,"2003-01-01","2003-12-31","C1S","A3F2",0,0,0,0]
[null,"A3F2 (C1S) 37987",null,"2004-01-01","2005-01-31","C1S","A3F2",0,0,0,0]
[null,"A3F2 (C1S) 38384",null,"2005-02-01","2005-12-30","C1S","A3F2",0,0,0,0]
[null,"A3F2 (C1S) 38717",null,"2005-12-31","2005-12-31","C1S","A3F2",0,0,0,0]
[null,"A3F2 (C1S) 38718",null,"2006-01-01","2006-12-31","C1S","A3F2",0,0,0,0]
[null,"A3F2 (C1S) 39083",null,"2007-01-01","2007-01-31","C1S","A3F2",0,0,0,0]
[null,"A3F2 (C1S) 39114",null,"2007-02-01","2007-12-31","C1S","A3F2",0,0,0,0]
[null,"A3F2 (C1S) 39448",null,"2008-01-01","2008-12-31","C1S","A3F2",0,0,0,0]
[null,"A3F2 (C1S) 39814",null,"2009-01-01","2010-03-31","C1S","A3F2",0,0,0,0]
[null,"A3F2 (C1S) 40269",null,"2010-04-01","2010-06-30","C1S","A3F2",{"$f":"ROUND(I207*12,2)","v":98.52},{"$f":"K207","v":8.2100000000000009},98.52,8.2100000000000009,"ind.vacanza contrattuale "]
[null,"A3F2 (C1S) 40360",null,"2010-07-01","2018-03-31","C1S","A3F2",{"$f":"ROUND(I208*12,2)","v":164.16},{"$f":"K208","v":13.68},{"$f":"VLOOKUP(G208,$O$4:$P$19,2,FALSE)","v":164.11},13.68]
[null,"A3F2 (C1S) 43191",null,"2018-04-01","2019-03-31",{"$f":"F208","v":"C1S"},{"$f":"G208","v":"A3F2"},0,0,{"$f":"H209","v":0},{"$f":"EXACT(H208,J208)","v":false}]
[null,"A3F2 (C1S) 44652",null,"2022-04-01","2022-06-30",{"$f":"F209","v":"C1S"},"A3F2",{"$f":"VLOOKUP(G210,'CCNL 2019-2021'!$C$32:$J$47,3,FALSE)","v":72.31},{"$f":"VLOOKUP(G210,'CCNL 2019-2021'!$C$32:$J$47,6,FALSE)","v":6.03},{"$f":"H210","v":72.31}]
[null,"A3F2 (C1S) 44743",null,"2022-07-01","2023-12-31","C1S","A3F2",{"$f":"VLOOKUP(G210,'CCNL 2019-2021'!$C$32:$J$47,4,FALSE)","v":120.52},{"$f":"VLOOKUP(G210,'CCNL 2019-2021'!$C$32:$J$47,7,FALSE)","v":10.039999999999999},120.52]
[null,"A3F2 (C1S) 45292",null,"2024-01-01","9999-01-01","C1S","A3F2",{"$f":"VLOOKUP(G211,'CCNL 2019-2021'!$C$32:$J$47,5,FALSE)+H211","v":927.73},{"$f":"VLOOKUP(G211,'CCNL 2019-2021'!$C$32:$J$47,8,FALSE)+I211","v":77.31},927.73]
[null,null,null,"C2","A3F3"]
[null,{"$f":"CONCATENATE(G214,\" (\",F214,\") \",D214)","v":"A3F3 (C2) 35977"},null,"1998-07-01","1998-10-31","C2","A3F3",0,0,{"$f":"H214","v":0},{"$f":"J214","v":0}]
[null,"A3F3 (C2) 36100",null,"1998-11-01","1999-05-31","C2","A3F3",0,0,0,0]
[null,"A3F3 (C2) 36312",null,"1999-06-01","2000-06-30","C2","A3F3",0,0,0,0]
[null,"A3F3 (C2) 36708",null,"2000-07-01","2000-12-31","C2","A3F3",0,0,0,0]
[null,"A3F3 (C2) 36892",null,"2001-01-01","2001-12-31","C2","A3F3",0,0,0,0]
[null,"A3F3 (C2) 37257",null,"2002-01-01","2002-12-31","C2","A3F3",0,0,0,0]
[null,"A3F3 (C2) 37622",null,"2003-01-01","2003-12-31","C2","A3F3",0,0,0,0]
[null,"A3F3 (C2) 37987",null,"2004-01-01","2005-01-31","C2","A3F3",0,0,0,0]
[null,"A3F3 (C2) 38384",null,"2005-02-01","2005-12-30","C2","A3F3",0,0,0,0]
[null,"A3F3 (C2) 38717",null,"2005-12-31","2005-12-31","C2","A3F3",0,0,0,0]
[null,"A3F3 (C2) 38718",null,"2006-01-01","2006-12-31","C2","A3F3",0,0,0,0]
[null,"A3F3 (C2) 39083",null,"2007-01-01","2007-01-31","C2","A3F3",0,0,0,0]
[null,"A3F3 (C2) 39114",null,"2007-02-01","2007-12-31","C2","A3F3",0,0,0,0]
[null,"A3F3 (C2) 39448",null,"2008-01-01","2008-12-31","C2","A3F3",0,0,0,0]
[null,"A3F3 (C2) 39814",null,"2009-01-01","2010-03-31","C2","A3F3",0,0,0,0]
[null,"A3F3 (C2) 40269",null,"2010-04-01","2010-06-30","C2","A3F3",{"$f":"ROUND(I229*12,2)","v":104.04},{"$f":"K229","v":8.67},104.04,8.67,"ind.vacanza contrattuale "]
[null,"A3F3 (C2) 40360",null,"2010-07-01","2018-03-31","C2","A3F3",{"$f":"ROUND(I230*12,2)","v":173.4},{"$f":"K230","v":14.45},{"$f":"VLOOKUP(G230,$O$4:$P$19,2,FALSE)","v":173.34},14.45]
[null,"A3F3 (C2) 43191",null,"2018-04-01","2022-03-31",{"$f":"F230","v":"C2"},{"$f":"G230","v":"A3F3"},0,0,{"$f":"H231","v":0},{"$f":"EXACT(H230,J230)","v":false}]
[null,"A3F3 (C2) 44652",null,"2022-04-01","2022-06-30",{"$f":"F231","v":"C2"},{"$f":"G231","v":"A3F3"},{"$f":"VLOOKUP(G232,'CCNL 2019-2021'!$C$32:$J$47,3,FALSE)","v":76.12},{"$f":"VLOOKUP(G232,'CCNL 2019-2021'!$C$32:$J$47,6,FALSE)","v":6.34},{"$f":"H232","v":76.12}]
[null,"A3F3 (C2) 44743",null,"2022-07-01","2023-12-31","C2","A3F3",{"$f":"VLOOKUP(G232,'CCNL 2019-2021'!$C$32:$J$47,4,FALSE)","v":126.87},{"$f":"VLOOKUP(G232,'CCNL 2019-2021'!$C$32:$J$47,7,FALSE)","v":10.57},126.87]
[null,"A3F3 (C2) 45292",null,"2024-01-01","9999-01-01","C2","A3F3",{"$f":"VLOOKUP(G233,'CCNL 2019-2021'!$C$32:$J$47,5,FALSE)+H233","v":976.7},{"$f":"VLOOKUP(G233,'CCNL 2019-2021'!$C$32:$J$47,8,FALSE)+I233","v":81.389999999999986},976.7]
[null,null,null,"C3","A3F4"]
[null,{"$f":"CONCATENATE(G236,\" (\",F236,\") \",D236)","v":"A3F4 (C3) 35977"},null,"1998-07-01","1998-10-31","C3","A3F4",0,0,{"$f":"H236","v":0},{"$f":"J236","v":0}]
[null,"A3F4 (C3) 36100",null,"1998-11-01","1999-05-31","C3","A3F4",0,0,0,0]
[null,"A3F4 (C3) 36312",null,"1999-06-01","2000-06-30","C3","A3F4",0,0,0,0]
[null,"A3F4 (C3) 36708",null,"2000-07-01","2000-12-31","C3","A3F4",0,0,0,0]
[null,"A3F4 (C3) 36892",null,"2001-01-01","2001-12-31","C3","A3F4",0,0,0,0]
[null,"A3F4 (C3) 37257",null,"2002-01-01","2002-12-31","C3","A3F4",0,0,0,0]
[null,"A3F4 (C3) 37622",null,"2003-01-01","2003-12-31","C3","A3F4",0,0,0,0]
[null,"A3F4 (C3) 37987",null,"2004-01-01","2005-01-31","C3","A3F4",0,0,0,0]
[null,"A3F4 (C3) 38384",null,"2005-02-01","2005-12-30","C3","A3F4",0,0,0,0]
[null,"A3F4 (C3) 38717",null,"2005-12-31","2005-12-31","C3","A3F4",0,0,0,0]
[null,"A3F4 (C3) 38718",null,"2006-01-01","2006-12-31","C3","A3F4",0,0,0,0]
[null,"A3F4 (C3) 39083",null,"2007-01-01","2007-01-31","C3","A3F4",0,0,0,0]
[null,"A3F4 (C3) 39114",null,"2007-02-01","2007-12-31","C3","A3F4",0,0,0,0]
[null,"A3F4 (C3) 39448",null,"2008-01-01","2008-12-31","C3","A3F4",0,0,0,0]
[null,"A3F4 (C3) 39814",null,"2009-01-01","2010-03-31","C3","A3F4",0,0,0,0]
[null,"A3F4 (C3) 40269",null,"2010-04-01","2010-06-30","C3","A3F4",{"$f":"ROUND(I251*12,2)","v":114.24},{"$f":"K251","v":9.52},114.24,9.52,"ind.vacanza contrattuale "]
[null,"A3F4 (C3) 40360",null,"2010-07-01","2018-03-31","C3","A3F4",{"$f":"ROUND(I252*12,2)","v":190.44},{"$f":"K252","v":15.87},{"$f":"VLOOKUP(G252,$O$4:$P$19,2,FALSE)","v":190.41},15.87]
[null,"A3F4 (C3) 43191",null,"2018-04-01","2019-03-31",{"$f":"F252","v":"C3"},{"$f":"G252","v":"A3F4"},0,0,{"$f":"H253","v":0},{"$f":"EXACT(H252,J252)","v":false}]
[null,"A3F4 (C3) 44652",null,"2022-04-01","2022-06-30",{"$f":"F253","v":"C3"},"A3F4",{"$f":"VLOOKUP(G254,'CCNL 2019-2021'!$C$32:$J$47,3,FALSE)","v":83.58},{"$f":"VLOOKUP(G254,'CCNL 2019-2021'!$C$32:$J$47,6,FALSE)","v":6.97},{"$f":"H254","v":83.58}]
[null,"A3F4 (C3) 44743",null,"2022-07-01","2023-12-31","C3","A3F4",{"$f":"VLOOKUP(G254,'CCNL 2019-2021'!$C$32:$J$47,4,FALSE)","v":139.29},{"$f":"VLOOKUP(G254,'CCNL 2019-2021'!$C$32:$J$47,7,FALSE)","v":11.61},139.29]
[null,"A3F4 (C3) 45292",null,"2024-01-01","9999-01-01","C3","A3F4",{"$f":"VLOOKUP(G255,'CCNL 2019-2021'!$C$32:$J$47,5,FALSE)+H255","v":1072.73},{"$f":"VLOOKUP(G255,'CCNL 2019-2021'!$C$32:$J$47,8,FALSE)+I255","v":89.4},1072.73]
[null,null,null,"C3S","A3F5"]
[null,{"$f":"CONCATENATE(G258,\" (\",F258,\") \",D258)","v":"A3F5 (C3S) 35977"},null,"1998-07-01","1998-10-31","C3S","A3F5",0,0,{"$f":"H258","v":0},{"$f":"J258","v":0}]
[null,"A3F5 (C3S) 36100",null,"1998-11-01","1999-05-31","C3S","A3F5",0,0,0,0]
[null,"A3F5 (C3S) 36312",null,"1999-06-01","2000-06-30","C3S","A3F5",0,0,0,0]
[null,"A3F5 (C3S) 36708",null,"2000-07-01","2000-12-31","C3S","A3F5",0,0,0,0]
[null,"A3F5 (C3S) 36892",null,"2001-01-01","2001-12-31","C3S","A3F5",0,0,0,0]
[null,"A3F5 (C3S) 37257",null,"2002-01-01","2002-12-31","C3S","A3F5",0,0,0,0]
[null,"A3F5 (C3S) 37622",null,"2003-01-01","2003-12-31","C3S","A3F5",0,0,0,0]
[null,"A3F5 (C3S) 37987",null,"2004-01-01","2005-01-31","C3S","A3F5",0,0,0,0]
[null,"A3F5 (C3S) 38384",null,"2005-02-01","2005-12-30","C3S","A3F5",0,0,0,0]
[null,"A3F5 (C3S) 38717",null,"2005-12-31","2005-12-31","C3S","A3F5",0,0,0,0]
[null,"A3F5 (C3S) 38718",null,"2006-01-01","2006-12-31","C3S","A3F5",0,0,0,0]
[null,"A3F5 (C3S) 39083",null,"2007-01-01","2007-01-31","C3S","A3F5",0,0,0,0]
[null,"A3F5 (C3S) 39114",null,"2007-02-01","2007-12-31","C3S","A3F5",0,0,0,0," "]
[null,"A3F5 (C3S) 39448",null,"2008-01-01","2008-12-31","C3S","A3F5",0,0,0,0]
[null,"A3F5 (C3S) 39814",null,"2009-01-01","2010-03-31","C3S","A3F5",0,0,0,0]
[null,"A3F5 (C3S) 40269",null,"2010-04-01","2010-06-30","C3S","A3F5",{"$f":"ROUND(I273*12,2)","v":121.68},{"$f":"K273","v":10.14},121.68,10.14,"ind.vacanza contrattuale "]
[null,"A3F5 (C3S) 40360",null,"2010-07-01","2018-03-31","C3S","A3F5",{"$f":"ROUND(I274*12,2)","v":202.8},{"$f":"K274","v":16.899999999999999},{"$f":"VLOOKUP(G274,$O$4:$P$19,2,FALSE)","v":202.81},16.899999999999999]
[null,"A3F5 (C3S) 43191",null,"2018-04-01","2019-03-31",{"$f":"F274","v":"C3S"},{"$f":"G274","v":"A3F5"},0,0,{"$f":"H275","v":0},{"$f":"EXACT(H274,J274)","v":false}]
[null,"A3F5 (C3S) 44652",null,"2022-04-01","2022-06-30",{"$f":"F275","v":"C3S"},"A3F5",{"$f":"VLOOKUP(G276,'CCNL 2019-2021'!$C$32:$J$47,3,FALSE)","v":88.97},{"$f":"VLOOKUP(G276,'CCNL 2019-2021'!$C$32:$J$47,6,FALSE)","v":7.41},{"$f":"H276","v":88.97}]
[null,"A3F5 (C3S) 44743",null,"2022-07-01","2023-12-31","C3S","A3F5",{"$f":"VLOOKUP(G276,'CCNL 2019-2021'!$C$32:$J$47,4,FALSE)","v":148.28},{"$f":"VLOOKUP(G276,'CCNL 2019-2021'!$C$32:$J$47,7,FALSE)","v":12.36},148.28]
[null,"A3F5 (C3S) 45292",null,"2024-01-01","9999-01-01","C3S","A3F5",{"$f":"VLOOKUP(G277,'CCNL 2019-2021'!$C$32:$J$47,5,FALSE)+H277","v":1142.03},{"$f":"VLOOKUP(G277,'CCNL 2019-2021'!$C$32:$J$47,8,FALSE)+I277","v":95.17},1142.03]
[null,null,null,"--------","A3F6"]
[null,{"$f":"CONCATENATE(G280,\" \",D280)","v":"A3F6 36100"},null,"1998-11-01","2007-12-30","--------","A3F6",0,0,{"$f":"H280","v":0},{"$f":"J280","v":0}]
[null,"A3F6 39447",null,"2007-12-31","2007-12-31","--------","A3F6",0,0,0,0]
[null,"A3F6 39448",null,"2008-01-01","2008-12-31","--------","A3F6",0,0,0,0]
[null,"A3F6 39814",null,"2009-01-01","2010-03-31","--------","A3F6",0,0,0,0]
[null,"A3F6 40269",null,"2010-04-01","2010-06-30","--------","A3F6",{"$f":"ROUND(I284*12,2)","v":129.96},{"$f":"K284","v":10.83},129.96,10.83,"ind.vacanza contrattuale "]
[null,"A3F6 40360",null,"2010-07-01","2018-03-31","--------","A3F6",{"$f":"ROUND(I285*12,2)","v":216.6},{"$f":"K285","v":18.05},{"$f":"VLOOKUP(G285,$O$4:$P$19,2,FALSE)","v":216.6},18.05]
[null,{"$f":"CONCATENATE(G286,\" \",D286)","v":"A3F6 43191"},null,"2018-04-01","2019-03-31",{"$f":"F285","v":"--------"},{"$f":"G285","v":"A3F6"},0,0,{"$f":"H286","v":0},{"$f":"EXACT(H285,J285)","v":true}]
[null,"A3F6 44652",null,"2022-04-01","2022-06-30",{"$f":"F286","v":"--------"},"A3F6",{"$f":"VLOOKUP(G287,'CCNL 2019-2021'!$C$32:$J$47,3,FALSE)","v":94.92},{"$f":"VLOOKUP(G287,'CCNL 2019-2021'!$C$32:$J$47,6,FALSE)","v":7.91},{"$f":"H287","v":94.92}]
[null,"A3F6 44743",null,"2022-07-01","2023-12-31","--------","A3F6",{"$f":"VLOOKUP(G287,'CCNL 2019-2021'!$C$32:$J$47,4,FALSE)","v":158.21},{"$f":"VLOOKUP(G287,'CCNL 2019-2021'!$C$32:$J$47,7,FALSE)","v":13.18},158.21]
[null,"A3F6 45292",null,"2024-01-01","9999-01-01","--------","A3F6",{"$f":"VLOOKUP(G288,'CCNL 2019-2021'!$C$32:$J$47,5,FALSE)+H288","v":1217.8800000000001},{"$f":"VLOOKUP(G288,'CCNL 2019-2021'!$C$32:$J$47,8,FALSE)+I288","v":101.49000000000001},1217.8800000000001]
[null,null,null,"--------","A3F7"]
[null,"A3F7 36100",null,"1998-11-01","2007-12-30","--------","A3F7",0,0,{"$f":"H291","v":0},{"$f":"J291","v":0}]
[null,"A3F7 39447",null,"2007-12-31","2007-12-31","--------","A3F7",0,0,0,0]
[null,"A3F7 39448",null,"2008-01-01","2008-12-31","--------","A3F7",0,0,0,0]
[null,"A3F7 39814",null,"2009-01-01","2010-03-31","--------","A3F7",0,0,0,0]
[null,"A3F7 40269",null,"2010-04-01","2010-06-30","--------","A3F7",{"$f":"ROUND(I295*12,2)","v":137.88},{"$f":"K295","v":11.49},137.88,11.49,"ind.vacanza contrattuale "]
[null,"A3F7 40360",null,"2010-07-01","2018-03-31","--------","A3F7",{"$f":"ROUND(I296*12,2)","v":229.92},{"$f":"K296","v":19.16},{"$f":"VLOOKUP(G296,$O$4:$P$19,2,FALSE)","v":229.86},19.16]
[null,"A3F7 43191",null,"2018-04-01","2019-03-31",{"$f":"F296","v":"--------"},{"$f":"G296","v":"A3F7"},0,0,{"$f":"H297","v":0},{"$f":"EXACT(H296,J296)","v":false}]
[null,"A3F7 44652",null,"2022-04-01","2022-06-30",{"$f":"F297","v":"--------"},"A3F7",{"$f":"VLOOKUP(G298,'CCNL 2019-2021'!$C$32:$J$47,3,FALSE)","v":100.84},{"$f":"VLOOKUP(G298,'CCNL 2019-2021'!$C$32:$J$47,6,FALSE)","v":8.4},{"$f":"H298","v":100.84},null,null," "]
[null,"A3F7 44743",null,"2022-07-01","2023-12-31","--------","A3F7",{"$f":"VLOOKUP(G298,'CCNL 2019-2021'!$C$32:$J$47,4,FALSE)","v":168.07},{"$f":"VLOOKUP(G298,'CCNL 2019-2021'!$C$32:$J$47,7,FALSE)","v":14.01},168.07]
[null,"A3F7 45292",null,"2024-01-01","9999-01-01","--------","A3F7",{"$f":"VLOOKUP(G299,'CCNL 2019-2021'!$C$32:$J$47,5,FALSE)+H299","v":1294.47},{"$f":"VLOOKUP(G299,'CCNL 2019-2021'!$C$32:$J$47,8,FALSE)+I299","v":107.88000000000001},1294.47]

{"sheet":"RIFERIMENTI","index":7,"n_rows":83,"n_cols":40,"rows_kept":83,"cut":false,"hidden":true,"merged":[]}
[{"$f":"CONCATENATE(C1,\" \",D1)","v":"ENTE UFF/MAND"}," ","ENTE","UFF/MAND",null,"ASSUNZIONE/IND. AMM.NE",null,0,"??","??",null,null,null,"RICERCA\nI.A. COM.",null,null,"CONTROLLO ERRORI SCHEDA \"CALCOLO\"",null,null,null,"COMPETENZA","SCADENZE","A/F","DECORRENZE","DATE DOPPIE","CONTA DOPPIE","SELEZIONE 1","RANGO 1","SELEZIONE 1 BIS","ORDINE 1 ","RISULTATO 1","RANGO 2","RISULTATO 1 BIS","ORDINE 2","RISULTATO 2","DAL","AL"]
[{"$f":"CONCATENATE(UPPER(C2),\" (\",$D$1,\": \",D2,\") \")","v":"AGENZIA INDUSTRIE DIFESA (UFF/MAND: 581/504) "},null,"Agenzia Industrie Difesa","581/504",null,{"$f":"IF(INSERIMENTO!G11<DATE(2009,1,1),DATE(2009,1,1),INSERIMENTO!G11)","v":"2009-01-01"},null,{"$f":"IF(K2=\"\",I2,CONCATENATE(I2,\" (\",K2,\")\"))","v":"A1F1 (A1)"},"A1F1",{"$f":"H3","v":"A1F2 (A1S)"},"A1","A1F1","1998-07-01",24,null,null,{"$f":"IF(INSERIMENTO!I7=\"DATO OBBLIGATORIO\",1,0)","v":0},"I7",null,null,"STIP.",null,null,"1998-07-01",{"$f":"COUNTIF($X$2:$X$67,X2)","v":1},{"$f":"COUNTIF($X$2:X2,X2)","v":1},{"$f":"IF(X2<$X$49,DATE(9999,12,31),IF(X2>$X$68,DATE(9999,12,31),IF(Z2>1,DATE(9999,12,31),X2)))","v":"9999-12-31"},{"$f":"RANK(AA2,$AA$2:$AA$67,1)","v":26},{"$f":"AA2","v":"9999-12-31"},1,{"$f":"IF(ISNA(VLOOKUP(AD2,$AB$2:$AC$67,2,FALSE)),DATE(9999,12,31),VLOOKUP(AD2,$AB$2:$AC$67,2,FALSE))","v":"2003-04-01"},{"$f":"RANK(AE2,$AE$2:$AE$67,1)","v":1},{"$f":"AE2","v":"2003-04-01"},1,{"$f":"IF(ISNA(VLOOKUP(AH2,$AF$2:$AG$67,2,FALSE)),DATE(9999,12,31),VLOOKUP(AH2,$AF$2:$AG$67,2,FALSE))","v":"2003-04-01"},{"$f":"IF(AI2=DATE(9999,12,31),\"\",AI2)","v":"2003-04-01"},{"$f":"IF(AI2=DATE(9999,12,31),\"\",IF(AJ3=\"\",$AI$69,AJ3-1))","v":"2003-12-31"}]
[{"$f":"CONCATENATE(UPPER(C3),\" (\",$D$1,\": \",D3,\") \")","v":"ARMAEREO (UFF/MAND: 123) "},null,"Armaereo",123,null,"9999-12-31",null,"A1F2 (A1S)","A1F2",{"$f":"H4","v":"A1F3"},"A1S","A1F2","1998-07-01",23,null,null,{"$f":"IF(INSERIMENTO!I9=\"INSERIRE IMPORTO\",1,0)","v":0},"I9",null,null,"STIP.",null,null,"1998-11-01",1,{"$f":"COUNTIF($X$2:X3,X3)","v":1},"9999-12-31",26,{"$f":"AA3","v":"9999-12-31"},{"$f":"AD2+1","v":2},"2004-01-01",2,{"$f":"AE3","v":"2004-01-01"},{"$f":"AH2+1","v":2},"2004-01-01",{"$f":"IF(AI3=DATE(9999,12,31),\"\",AI3)","v":"2004-01-01"},"2005-01-31"]
["BILANDIFE (UFF/MAND: 135) ",null,"Bilandife",135,null,null,null,"A1F3","A1F3",null,null,null,"2007-12-31",22,null,null,{"$f":"IF(INSERIMENTO!E10=\"DATO OBBLIGATORIO\",1,IF(INSERIMENTO!E10=\"ERRORE\",1,0))","v":0},"E10",null,null,"STIP.",null,null,"1999-06-01",1,{"$f":"COUNTIF($X$2:X4,X4)","v":1},"9999-12-31",26,"9999-12-31",{"$f":"AD3+1","v":3},"2005-02-01",3,"2005-02-01",{"$f":"AH3+1","v":3},"2005-02-01","2005-02-01","2005-12-30"]
["CAPO CORPO GENIO A.M. (UFF/MAND: 84) ",null,"Capo Corpo Genio A.M.",84,null,null,null,"A2F1 (B1)","A2F1",{"$f":"H6","v":"A2F2 (B2)"},"B1","A2F1","1998-07-01",21,null,null,{"$f":"IF(INSERIMENTO!G10=\"DATA ?\",1,IF(INSERIMENTO!G10=\"ERRORE\",1,0))","v":0},"G10",null,null,"STIP.",null,null,"2000-07-01",2,{"$f":"COUNTIF($X$2:X5,X5)","v":1},"9999-12-31",26,"9999-12-31",4,"2005-12-31",4,"2005-12-31",4,"2005-12-31","2005-12-31","2005-12-31"]
["CASD (UFF/MAND: 44) ",null,"CASD",44,null,null,null,"A2F2 (B2)","A2F2",{"$f":"H7","v":"A2F3 (B3)"},"B2","A2F2","1998-07-01",20,null,null,{"$f":"IF(INSERIMENTO!N12=\"ERRORE\",1,0)","v":0},"N12",null,null,"STIP.",null,null,"2001-01-01",2,{"$f":"COUNTIF($X$2:X6,X6)","v":1},"9999-12-31",26,"9999-12-31",5,"2006-01-01",5,"2006-01-01",5,"2006-01-01","2006-01-01","2006-12-31"]
["CIRCOLO SOTTUFF. M.M. ROMA (UFF/MAND: 67) ",null,"Circolo Sottuff. M.M. Roma",67,null,null,null,"A2F3 (B3)","A2F3",{"$f":"H8","v":"A2F4 (B3S)"},"B3","A2F3","1998-07-01",19,null,null,{"$f":"IF(INSERIMENTO!E16=\"DATO OBBLIGATORIO\",1,IF(INSERIMENTO!E16=\"ERRORE\",1,0))","v":0},"E16",{"$f":"Q7","v":0},null,"STIP.",null,null,"2002-01-01",2,{"$f":"COUNTIF($X$2:X7,X7)","v":1},"9999-12-31",26,"9999-12-31",6,"2007-01-01",6,"2007-01-01",6,"2007-01-01","2007-01-01","2007-01-31"]
["CIRCOLO UFFIC.CAIO DUILIO M.M. (UFF/MAND: 64) ",null,"Circolo Uffic.Caio Duilio M.M.",64,null,null,null,"A2F4 (B3S)","A2F4",{"$f":"H9","v":"A2F5"},"B3S","A2F4","1998-07-01",18,null,null,{"$f":"IF(INSERIMENTO!E18=\"DATO OBBLIGATORIO\",1,IF(INSERIMENTO!E18=\"ERRORE\",1,0))","v":0},"E18",{"$f":"Q8","v":0},null,"STIP.",null,null,"2003-01-01",2,{"$f":"COUNTIF($X$2:X8,X8)","v":1},"9999-12-31",26,"9999-12-31",7,"2007-02-01",7,"2007-02-01",7,"2007-02-01","2007-02-01","2007-12-30"]
["CNA ESERCITO (EX CUSE) (UFF/MAND: 430) ",null,"CNA Esercito (ex CUSE)",430,null,null,null,"A2F5","A2F5",{"$f":"H10","v":"A2F6"},null,null,"2007-12-31",17,null,null,{"$f":"IF(INSERIMENTO!E20=\"DATO OBBLIGATORIO\",1,IF(INSERIMENTO!E20=\"ERRORE\",1,0))","v":0},"E20",0,null,"STIP.",null,null,"2004-01-01",1,{"$f":"COUNTIF($X$2:X9,X9)","v":1},"2004-01-01",2,"2004-01-01",8,"2007-12-31",8,"2007-12-31",8,"2007-12-31","2007-12-31","2007-12-31"]
["COLLEGIO MEDICO LEGALE (UFF/MAND: 38) ",null,"Collegio Medico Legale",38,null,null,null,"A2F6","A2F6",null,null,null,"2007-12-31",16,null,null,{"$f":"IF(INSERIMENTO!E22=\"DATO OBBLIGATORIO\",1,IF(INSERIMENTO!E22=\"ERRORE\",1,0))","v":0},"E22",0,null,"STIP.",null,null,"2005-02-01",1,{"$f":"COUNTIF($X$2:X10,X10)","v":1},"2005-02-01",3,"2005-02-01",9,"2008-01-01",9,"2008-01-01",9,"2008-01-01","2008-01-01","2008-12-31"]
["COMAER - BANDA MUSICALE PAL. A.M. (UFF/MAND: 82) ",null,"Comaer - Banda Musicale Pal. A.M.",82,null,null,null,"A3F1 (C1)","A3F1",{"$f":"H12","v":"A3F2 (C1S)"},"C1","A3F1","1998-07-01",15,null,null,{"$f":"IF(INSERIMENTO!E24=\"DATO OBBLIGATORIO\",1,IF(INSERIMENTO!E24=\"ERRORE\",1,0))","v":0},"E24",0,null,"STIP.",null,null,"2005-12-31",1,{"$f":"COUNTIF($X$2:X11,X11)","v":1},"2005-12-31",4,"2005-12-31",10,"2009-01-01",10,"2009-01-01",10,"2009-01-01","2009-01-01","2009-05-04"]
["COMAER - DIREZIONE DI INTENDENZA PAL. A.M. (UFF/MAND: 82) ",null,"Comaer - Direzione di Intendenza Pal. A.M.",82,null,null,null,"A3F2 (C1S)","A3F2","A3F3 (C2)","C1S","A3F2","1998-07-01",14,null,null,{"$f":"IF(INSERIMENTO!E26=\"DATO OBBLIGATORIO\",1,IF(INSERIMENTO!E26=\"ERRORE\",1,0))","v":0},"E26",0,null,"STIP.",null,null,"2006-01-01",1,{"$f":"COUNTIF($X$2:X12,X12)","v":1},"2006-01-01",5,"2006-01-01",11,"2009-05-05",11,"2009-05-05",11,"2009-05-05","2009-05-05","2010-03-31"]
["COMANDATI ENTI CENTRALI (UFF/MAND: 55) ",null,"Comandati Enti Centrali",55,null,null,null,"A3F3 (C2)","A3F3","A3F4 (C3)","C2","A3F3","1998-07-01",13,null,null,{"$f":"IF(INSERIMENTO!G16=\"DATA ?\",1,IF(INSERIMENTO!G16=\"ERRORE\",1,0))","v":0},"G16",0,null,"STIP.",null,null,"2007-01-01",1,{"$f":"COUNTIF($X$2:X13,X13)","v":1},"2007-01-01",6,"2007-01-01",12,"2010-04-01",12,"2010-04-01",12,"2010-04-01","2010-04-01","2010-06-30"]
["COMANDO OPERATIVO IN RETE (EX COMANDO C4) (UFF/MAND: 22) ",null,"Comando Operativo in Rete (ex Comando C4)",22,null,null,null,"A3F4 (C3)","A3F4","A3F5 (C3S)","C3","A3F4","1998-07-01",12,null,null,{"$f":"IF(INSERIMENTO!G18=\"DATA ?\",1,IF(INSERIMENTO!G18=\"ERRORE\",1,0))","v":0},"G18",0,null,"STIP.",null,null,"2007-02-01",1,{"$f":"COUNTIF($X$2:X14,X14)","v":1},"2007-02-01",7,"2007-02-01",13,"2010-07-01",13,"2010-07-01",13,"2010-07-01","2010-07-01","2013-05-04"]
["COMANDO SQUADRA AEREA PALAZZO A.M. (UFF/MAND: 740) ",null,"Comando Squadra Aerea Palazzo A.M.",740,null,null,null,"A3F5 (C3S)","A3F5","A3F6","C3S","A3F5","1998-07-01",11,null,null,{"$f":"IF(INSERIMENTO!G20=\"DATA ?\",1,IF(INSERIMENTO!G20=\"ERRORE\",1,0))","v":0},"G20",0,null,"STIP.",null,null,"2007-12-31",3,{"$f":"COUNTIF($X$2:X15,X15)","v":1},"2007-12-31",8,"2007-12-31",14,"2013-05-05",14,"2013-05-05",14,"2013-05-05","2013-05-05","2015-12-31"]
["COMLOG A.M. (UFF/MAND: 143) ",null,"Comlog A.M.",143,null,null,null,"A3F6","A3F6","A3F7",null,null,"2007-12-31",10,null,null,{"$f":"IF(INSERIMENTO!G22=\"DATA ?\",1,IF(INSERIMENTO!G22=\"ERRORE\",1,0))","v":0},"G22",0,null,"STIP.",null,null,"2008-01-01",1,{"$f":"COUNTIF($X$2:X16,X16)","v":1},"2008-01-01",9,"2008-01-01",15,"2016-01-01",15,"2016-01-01",15,"2016-01-01","2016-01-01","2016-12-31"]
["COMLOG ES (EX ISPELOG) (UFF/MAND: 141) ",null,"Comlog ES (ex Ispelog)",141,null,null,null,"A3F7","A3F7",null,null,null,"2007-12-31",9,null,null,{"$f":"IF(INSERIMENTO!G24=\"DATA ?\",1,IF(INSERIMENTO!G24=\"ERRORE\",1,0))","v":0},"G24",0,null,"STIP.",null,null,"2009-01-01",1,{"$f":"COUNTIF($X$2:X17,X17)","v":1},"2009-01-01",10,"2009-01-01",16,"2017-01-01",16,"2017-01-01",16,"2017-01-01","2017-01-01","2018-02-28"]
["COMMISERVIZI A.M. (UFF/MAND: 134) ",null,"Commiservizi A.M.",134,null,null,null,null,null,null,null,null,null,null,null,null,{"$f":"IF(INSERIMENTO!G26=\"DATA ?\",1,IF(INSERIMENTO!G26=\"ERRORE\",1,0))","v":0},"G26",0,null,"STIP.",null,null,"2010-04-01",2,{"$f":"COUNTIF($X$2:X18,X18)","v":1},"2010-04-01",12,"2010-04-01",17,"2018-03-01",17,"2018-03-01",17,"2018-03-01","2018-03-01","2018-03-31"]
["COMMISERVIZI E.I. (UFF/MAND: 132) ",null,"Commiservizi E.I.",132,null,null,null,null,null,null,null,null,null,null,null,null,{"$f":"IF(INSERIMENTO!M16=\"DATA ?\",1,IF(INSERIMENTO!M16=\"AMM.NE ?\",1,IF(INSERIMENTO!M16=\"ERRORE\",1,0)))","v":0},"M16",0,null,"STIP.",null,null,"2010-07-01",2,{"$f":"COUNTIF($X$2:X19,X19)","v":1},"2010-07-01",13,"2010-07-01",18,"2018-04-01",18,"2018-04-01",18,"2018-04-01","2018-04-01","2018-12-31"]
["COMMISERVIZI M.M. (UFF/MAND: 133) ",null,"Commiservizi M.M.",133,null,null,null,"INSERIMENTO",null,"centododici",null,null,null,null,null,null,{"$f":"IF(INSERIMENTO!M18=\"DATA ?\",1,IF(INSERIMENTO!M18=\"AMM.NE ?\",1,IF(INSERIMENTO!M18=\"ERRORE\",1,0)))","v":0},"M18",0,null,"STIP.",null,null,"2016-01-01",2,{"$f":"COUNTIF($X$2:X20,X20)","v":1},"2016-01-01",15,"2016-01-01",19,"2019-01-01",19,"2019-01-01",19,"2019-01-01","2019-01-01","2019-12-31"]
["COMSEV (UFF/MAND: 82) ",null,"Comsev",82,null,null,null,"SVILUPPO",null,"centotredici",null,null,null,null,null,null,{"$f":"IF(INSERIMENTO!M20=\"DATA ?\",1,IF(INSERIMENTO!M20=\"AMM.NE ?\",1,IF(INSERIMENTO!M20=\"ERRORE\",1,0)))","v":0},"M20",0,null,"STIP.",null,null,"2017-01-01",1,{"$f":"COUNTIF($X$2:X21,X21)","v":1},"2017-01-01",16,"2017-01-01",20,"2020-01-01",20,"2020-01-01",20,"2020-01-01","2020-01-01","2020-12-31"]
["CONS. MAG. MIL. (UFF/MAND: 46) ",null,"Cons. Mag. Mil.",46,null,null,null,"STIPENDIO"," ","centoquattordici",null,null,null,null,null,null,{"$f":"IF(INSERIMENTO!M22=\"DATA ?\",1,IF(INSERIMENTO!M22=\"AMM.NE ?\",1,IF(INSERIMENTO!M22=\"ERRORE\",1,0)))","v":0},"M22",0,null,"STIP.",null,null,"2018-03-01",1,{"$f":"COUNTIF($X$2:X22,X22)","v":1},"2018-03-01",17,"2018-03-01",21,"2021-01-01",21,"2021-01-01",21,"2021-01-01","2021-01-01","2022-03-31"]
["CORTE MIL. APPELLO (UFF/MAND: 36) ",null,"Corte Mil. Appello",36,null,null,null,"CCNL 2019-2021",null,"centoquindici",null,null," ",null,null,null,{"$f":"IF(INSERIMENTO!M24=\"DATA ?\",1,IF(INSERIMENTO!M24=\"AMM.NE ?\",1,IF(INSERIMENTO!M24=\"ERRORE\",1,0)))","v":0},"M24",0,null,"STIP.",null,null,"2018-04-01",2,{"$f":"COUNTIF($X$2:X23,X23)","v":1},"2018-04-01",18,"2018-04-01",22,"2022-04-01",22,"2022-04-01",22,"2022-04-01","2022-04-01","2022-06-30"]
[{"$f":"CONCATENATE(UPPER(C24),\" (\",$D$1,\": \",D24,\") \")","v":"COVI (COMANDO OPERATIVO DI VERTICE INTERFORZE) (UFF/MAND: 743) "},null,"COVI (Comando Operativo di Vertice Interforze)",743,null,null,null,"IND. INT. SPEC.",null,"centosedici",null,null,null,null,null,null,{"$f":"IF(INSERIMENTO!M26=\"DATA ?\",1,IF(INSERIMENTO!M26=\"AMM.NE ?\",1,IF(INSERIMENTO!M26=\"ERRORE\",1,0)))","v":0},"M26",{"$f":"Q24","v":0},null,"STIP.",null,null,"2019-01-01",1,{"$f":"COUNTIF($X$2:X24,X24)","v":1},"2019-01-01",19,{"$f":"AA24","v":"2019-01-01"},23,"2022-07-01",23,"2022-07-01",23,"2022-07-01","2022-07-01","2022-10-31"]
["CUFA (CIRCOLO UFFICIALI FORZE ARMATE) (UFF/MAND: 749) ",null,"CUFA (Circolo Ufficiali Forze Armate)",749,null,null,null,"IND. AMM.NE",null,"centodiciassette",null,null,null,null,null,null,{"$f":"IF(INSERIMENTO!O16=\"DATA ?\",1,IF(INSERIMENTO!O16=\"AMM.NE ?\",1,IF(INSERIMENTO!O16=\"ERRORE\",1,0)))","v":0},"O16",0,null,"STIP.",null,null,"2020-01-01",2,{"$f":"COUNTIF($X$2:X25,X25)","v":1},"2020-01-01",20,"2020-01-01",24,"2022-11-01",24,"2022-11-01",24,"2022-11-01","2022-11-01","2023-12-31"]
["DIFEFORM (UFF/MAND: 72) ",null,"Difeform",72,null,null,null,"VAC. CONTR.LE",null,"centodiciotto",null,null,null,null,null,null,{"$f":"IF(INSERIMENTO!O18=\"DATA ?\",1,IF(INSERIMENTO!O18=\"AMM.NE ?\",1,IF(INSERIMENTO!O18=\"ERRORE\",1,0)))","v":0},"O18",0,null,"STIP.",null,null,"2021-01-01",3,{"$f":"COUNTIF($X$2:X26,X26)","v":1},"2021-01-01",21,"2021-01-01",25,"2024-01-01",25,"2024-01-01",25,"2024-01-01","2024-01-01","9999-12-31"]
["GABINETTO ESERCITO (UFF/MAND: 136) ",null,"Gabinetto esercito",136,null,null,null,"RIFERIMENTI",null,"centodiciannove",null,null,null,null,null,null,{"$f":"IF(INSERIMENTO!O20=\"DATA ?\",1,IF(INSERIMENTO!O20=\"AMM.NE ?\",1,IF(INSERIMENTO!O20=\"ERRORE\",1,0)))","v":0},"O20",0,null,"STIP.",null,null,"2022-07-01",2,{"$f":"COUNTIF($X$2:X27,X27)","v":1},"2022-07-01",23,"2022-07-01",26,"9999-12-31",26,"9999-12-31",26,"9999-12-31","",""]
[{"$f":"CONCATENATE(UPPER(C28),\" (\",$D$1,\": \",D28,\") \")","v":"GENIODIFE (UFF/MAND: 127) "},null,"Geniodife",127,null,null,null,null,null,null,null,null,null,null,null,null,{"$f":"IF(INSERIMENTO!O22=\"DATA ?\",1,IF(INSERIMENTO!O22=\"AMM.NE ?\",1,IF(INSERIMENTO!O22=\"ERRORE\",1,0)))","v":0},"O22",{"$f":"Q28","v":0},null,"STIP.",null,null,"2022-11-01",3,{"$f":"COUNTIF($X$2:X28,X28)","v":1},"2022-11-01",24,{"$f":"AA28","v":"2022-11-01"},27,"9999-12-31",26,{"$f":"AE28","v":"9999-12-31"},27,"9999-12-31",{"$f":"IF(AI28=DATE(9999,12,31),\"\",AI28)","v":""},""]
["IMAS (ISTITUTO MEDICINA AEROSPAZIALE A.M.) (UFF/MAND: 88) ",null,"Imas (Istituto Medicina Aerospaziale A.M.)",88,null,null,null,null,null,null,null,null,null,null,null,null,{"$f":"IF(INSERIMENTO!O24=\"DATA ?\",1,IF(INSERIMENTO!O24=\"AMM.NE ?\",1,IF(INSERIMENTO!O24=\"ERRORE\",1,0)))","v":0},"O24",{"$f":"Q29","v":0},null,"I.I.S.",null,null,"1991-11-01",1,{"$f":"COUNTIF($X$2:X29,X29)","v":1},"9999-12-31",26,"9999-12-31",28,"9999-12-31",26,"9999-12-31",28,"9999-12-31","",""]
["ISPEDIFE (UFF/MAND: 21) ",null,"Ispedife",21,null,null,null,"CARTELLE",null,"centoventi",null,null,null," ",null,null,{"$f":"IF(INSERIMENTO!O26=\"DATA ?\",1,IF(INSERIMENTO!O26=\"AMM.NE ?\",1,IF(INSERIMENTO!O26=\"ERRORE\",1,0)))","v":0},"O26",{"$f":"Q30","v":0},null,"I.I.S.",null,null,"2007-12-31",3,{"$f":"COUNTIF($X$2:X30,X30)","v":2},"9999-12-31",26,"9999-12-31",29,"9999-12-31",26,"9999-12-31",29,"9999-12-31","",""]
["MARICAPITALE (COMANDO MARITTIMO CENTRO E CAPITALE) (UFF/MAND: 69) ",null,"Maricapitale (Comando Marittimo Centro e Capitale)",69,null,null,null,null,null,null,null,null,null,null,null,null,{"$f":"SUM(Q2:Q29)","v":0},"TOT.",{"$f":"SUM(S7:S29)","v":0},null,"I.I.S.",null,null,"2022-11-01",3,{"$f":"COUNTIF($X$2:X31,X31)","v":2},"9999-12-31",26,"9999-12-31",30,"9999-12-31",26,"9999-12-31",30,"9999-12-31","",""]
["MARICRYPTO (UFF/MAND: 68) ",null,"Maricrypto",68,null,null,null,null,null,null,null,null,null,null,null,null,null,null,null,null,"V. C.",null,null,"2010-04-01",2,{"$f":"COUNTIF($X$2:X32,X32)","v":2},"9999-12-31",26,"9999-12-31",31,"9999-12-31",26,"9999-12-31",31,"9999-12-31","",""]
["MARIGEMINIL ROMA (UFF/MAND: 71) ",null,"Marigeminil Roma",71,null,null,null,"MACRO",null,"centoventuno",null,null,null,null,null,null,null,null,null,null,"V. C.",null,null,"2010-07-01",2,{"$f":"COUNTIF($X$2:X33,X33)","v":2},"9999-12-31",26,"9999-12-31",32,"9999-12-31",26,"9999-12-31",32,"9999-12-31","",""]
["MARINFERM ROMA (EX MARIDIST ROMA) (UFF/MAND: 63) ",null,"Marinferm Roma (ex Maridist Roma)",63,null,null,null,null,null,null,null,null,null,null,null,null,null,null,null,null,"V. C.",null,null,"2018-04-01",{"$f":"COUNTIF($X$2:$X$67,X34)","v":2},{"$f":"COUNTIF($X$2:X34,X34)","v":2},{"$f":"IF(X34<$X$49,DATE(9999,12,31),IF(X34>$X$68,DATE(9999,12,31),IF(Z34>1,DATE(9999,12,31),X34)))","v":"9999-12-31"},{"$f":"RANK(AA34,$AA$2:$AA$67,1)","v":26},"9999-12-31",33,{"$f":"IF(ISNA(VLOOKUP(AD34,$AB$2:$AC$67,2,FALSE)),DATE(9999,12,31),VLOOKUP(AD34,$AB$2:$AC$67,2,FALSE))","v":"9999-12-31"},{"$f":"RANK(AE34,$AE$2:$AE$67,1)","v":26},"9999-12-31",33,{"$f":"IF(ISNA(VLOOKUP(AH34,$AF$2:$AG$67,2,FALSE)),DATE(9999,12,31),VLOOKUP(AH34,$AF$2:$AG$67,2,FALSE))","v":"9999-12-31"},"",""]
["MARINTENDENZA ROMA (EX MARICOMMI ROMA) (UFF/MAND: 73) ",null,"Marintendenza Roma (ex Maricommi Roma)",73,null,null,null,null,null,null,null,null,null,null,null,null,null,null,null,null,"V. C.",null,null,"2022-04-01",1,{"$f":"COUNTIF($X$2:X35,X35)","v":1},"2022-04-01",22,"2022-04-01",34,"9999-12-31",26,"9999-12-31",34,"9999-12-31","",""]
["MARIREMO SABAUDIA (UFF/MAND: 58) ",null,"Mariremo Sabaudia",58,null,null,null,null,null,null,null,null,null,null,null,null,null,null,null,null,"V. C.",null,null,"2022-07-01",2,{"$f":"COUNTIF($X$2:X36,X36)","v":2},"9999-12-31",26,"9999-12-31",35,"9999-12-31",26,"9999-12-31",35,"9999-12-31","",{"$f":"IF(AI36=DATE(9999,12,31),\"\",IF(AJ38=\"\",$AI$69,AJ38-1))","v":""}]
[{"$f":"CONCATENATE(UPPER(C37),\" (\",$D$1,\": \",D37,\") \")","v":"MARITELE ROMA (UFF/MAND: 74) "},null,"Maritele Roma",74,null,null,null,null,null,null,null,null,null,null,null,null,null,null,null,null,"V. C.",null,null,"2024-01-01",1,{"$f":"COUNTIF($X$2:X37,X37)","v":1},"2024-01-01",25,"2024-01-01",36,"9999-12-31",26,"9999-12-31",36,"9999-12-31",{"$f":"IF(AI37=DATE(9999,12,31),\"\",AI37)","v":""},{"$f":"IF(AI37=DATE(9999,12,31),\"\",IF(AJ39=\"\",$AI$69,AJ39-1))","v":""}]
["MINISTRO E SOTTOSEGRETARI (UFF/MAND: 1) ",null,"Ministro e Sottosegretari",1,null,null,null,null,null,null,null,null,null,null,null,null,null,null,null,null,"I.A.",null,null,"1995-01-01",1,{"$f":"COUNTIF($X$2:X38,X38)","v":1},"9999-12-31",26,"9999-12-31",37,"9999-12-31",26,"9999-12-31",37,"9999-12-31","",{"$f":"IF(AI38=DATE(9999,12,31),\"\",IF(AJ39=\"\",$AI$69,AJ39-1))","v":""}]
["NAVARM (UFF/MAND: 122) ",null,"Navarm",122,null,null,null,null,null,null,null,null,null,null,null,null,null,null,null,null,"I.A.",null,null,"1997-07-01",1,{"$f":"COUNTIF($X$2:X39,X39)","v":1},"9999-12-31",26,"9999-12-31",38,"9999-12-31",26,"9999-12-31",38,"9999-12-31","",""]
["ONORCADUTI (UFF/MAND: 429) ",null,"Onorcaduti",429,null,null,null,null,null,null,null,null,null,null,null,null,null,null,null,null,"I.A.",null,null,"2000-01-01",1,{"$f":"COUNTIF($X$2:X40,X40)","v":1},"9999-12-31",26,"9999-12-31",39,"9999-12-31",26,"9999-12-31",39,"9999-12-31","",""]
["ORDINARIATO MILITARE (UFF/MAND: 34) ",null,"Ordinariato Militare",34,null,null,null,null,null,null,null,null,null,null,null,null,null,null,null,null,"I.A.",null,null,"2000-07-01",2,{"$f":"COUNTIF($X$2:X41,X41)","v":2},"9999-12-31",26,"9999-12-31",40,"9999-12-31",26,"9999-12-31",40,"9999-12-31","",""]
["PERIFERIA AERONAUTICA (UFF/MAND: 742/501) ",null,"Periferia Aeronautica","742/501",null,null,null,null,null,null,null,null,null,null,null,null,null,null,null,null,"I.A.",null,null,"2001-01-01",2,{"$f":"COUNTIF($X$2:X42,X42)","v":2},"9999-12-31",26,"9999-12-31",41,"9999-12-31",26,"9999-12-31",41,"9999-12-31","",""]
["PERIFERIA CARABINIERI (UFF/MAND: 600) ",null,"Periferia Carabinieri",600,null,null,null,null,null,null,null,null,null,null,null,null,null,null," ",null,"I.A.",null,null,"2002-01-01",2,{"$f":"COUNTIF($X$2:X43,X43)","v":2},"9999-12-31",26,"9999-12-31",42,"9999-12-31",26,"9999-12-31",42,"9999-12-31","",""]
["PERIFERIA CARABINIERI/FORESTALI (UFF/MAND: 737) ",null,"Periferia Carabinieri/Forestali",737,null,null,null,null,null,null,null,null,null,null,null,null,null,null,null,null,"I.A.",null,null,"2003-01-01",2,{"$f":"COUNTIF($X$2:X44,X44)","v":2},"9999-12-31",26,"9999-12-31",43,"9999-12-31",26,"9999-12-31",43,"9999-12-31","",""]
["PERIFERIA ESERCITO (UFF/MAND: 740/502) ",null,"Periferia Esercito","740/502",null,null,null,null,null,null,null,null,null,null,null,null,null,null,null,null,"I.A.",null,null,"2007-12-31",3,{"$f":"COUNTIF($X$2:X45,X45)","v":3},"9999-12-31",26,"9999-12-31",44,"9999-12-31",26,"9999-12-31",44,"9999-12-31","",""]
["PERIFERIA MARINA (UFF/MAND: 741/503) ",null,"Periferia Marina","741/503",null,null,null,null,null,null,null,null,null,null,null,null,null,null,null,null,"I.A.",null,null,"2020-01-01",2,{"$f":"COUNTIF($X$2:X46,X46)","v":2},"9999-12-31",26,{"$f":"AA46","v":"9999-12-31"},45,"9999-12-31",26,"9999-12-31",45,"9999-12-31","",""]
["PERSOCIV  (UFF/MAND: 91) ",null,"Persociv ",91,null,null,null,null,null,null,null,null,null,null,null,null,null,null,null,null,"I.A.",null,null,"2021-01-01",3,{"$f":"COUNTIF($X$2:X47,X47)","v":2},"9999-12-31",26,"9999-12-31",46,"9999-12-31",26,"9999-12-31",46,"9999-12-31","",{"$f":"IF(AI47=DATE(9999,12,31),\"\",IF(AJ49=\"\",$AI$69,AJ49-1))","v":""}]
["PERSOMIL ORVIETO (UFF/MAND: 748) ",null,"Persomil Orvieto",748,null,null,null,null,null,null,null,null,null,null,null,null,null,null,null,null,"I.A.",null,null,"2022-11-01",3,{"$f":"COUNTIF($X$2:X48,X48)","v":3},"9999-12-31",26,{"$f":"AA48","v":"9999-12-31"},47,"9999-12-31",26,{"$f":"AE48","v":"9999-12-31"},47,"9999-12-31",{"$f":"IF(AI48=DATE(9999,12,31),\"\",AI48)","v":""},{"$f":"IF(AI48=DATE(9999,12,31),\"\",IF(AJ50=\"\",$AI$69,AJ50-1))","v":""}]
["PERSOMIL ROMA  (UFF/MAND: 113) ",null,"Persomil Roma ",113,null,null,null,null,null,null,null,null,null,null,null,null,null,null,"G11","E11","1 A/F",{"$f":"IF(INSERIMENTO!G11=\"\",\"\",INSERIMENTO!G11)","v":"2003-04-01"},{"$f":"IF(INSERIMENTO!E11=\"\",\"\",INSERIMENTO!E11)","v":"A3F1 (C1)"},{"$f":"V49","v":"2003-04-01"},1,{"$f":"COUNTIF($X$2:X49,X49)","v":1},"2003-04-01",1,"2003-04-01",48,"9999-12-31",26,"9999-12-31",48,"9999-12-31","",{"$f":"IF(AI49=DATE(9999,12,31),\"\",IF(AJ50=\"\",$AI$69,AJ50-1))","v":""}]
["PREVIMIL (UFF/MAND: 120) ",null,"Previmil",120,null,null,null,null,null,null,null,null,null,null,null,null,null,null,"G17","E17","2 A/F",{"$f":"IF(INSERIMENTO!G17=\"\",\"\",INSERIMENTO!G17)","v":"2016-01-01"},{"$f":"IF(INSERIMENTO!E17=\"\",\"\",INSERIMENTO!E17)","v":"A3F2 (C1S)"},{"$f":"V50","v":"2016-01-01"},2,{"$f":"COUNTIF($X$2:X50,X50)","v":2},"9999-12-31",26,"9999-12-31",49,"9999-12-31",26,"9999-12-31",49,"9999-12-31","",""]
["PROC. MIL. CORTE APPELLO (UFF/MAND: 51) ",null,"Proc. Mil. Corte Appello",51,null,null,null,null,null,null,null,null,null,null,null,null,null,null,"G19","E19","3 A/F",{"$f":"IF(INSERIMENTO!G19=\"\",\"\",INSERIMENTO!G19)","v":"2021-01-01"},{"$f":"IF(INSERIMENTO!E19=\"\",\"\",INSERIMENTO!E19)","v":"A3F3 (C2)"},"2021-01-01",3,{"$f":"COUNTIF($X$2:X51,X51)","v":3},"9999-12-31",26,"9999-12-31",50,"9999-12-31",26,"9999-12-31",50,"9999-12-31","",""]
["PROC. MIL. CORTE CASS. (UFF/MAND: 43) ",null,"Proc. Mil. Corte Cass.",43,null,null,null,null,null,null,null,null,null,null,null,null,null,null,"G21","E21","4 A/F",{"$f":"IF(INSERIMENTO!G21=\"\",\"\",INSERIMENTO!G21)","v":""},{"$f":"IF(INSERIMENTO!E21=\"\",\"\",INSERIMENTO!E21)","v":""},"",14,{"$f":"COUNTIF($X$2:X52,X52)","v":1},"9999-12-31",26,"9999-12-31",51,"9999-12-31",26,"9999-12-31",51,"9999-12-31","",""]
["PROC. TRIB. MIL. ROMA (UFF/MAND: 738) ",null,"Proc. Trib. Mil. Roma",738,null,null,null,null,null,null,null,null,null,null,null,null,null,null,"G23","E23","5 A/F",{"$f":"IF(INSERIMENTO!G23=\"\",\"\",INSERIMENTO!G23)","v":""},{"$f":"IF(INSERIMENTO!E23=\"\",\"\",INSERIMENTO!E23)","v":""},"",14,{"$f":"COUNTIF($X$2:X53,X53)","v":2},"9999-12-31",26,"9999-12-31",52,"9999-12-31",26,"9999-12-31",52,"9999-12-31","",""]
["QUARTIER GENERALE MARINA SANTA ROSA (UFF/MAND: 66) ",null,"Quartier Generale Marina Santa Rosa",66,null,null,null,null,null,null,null,null,null,null,null,null,null,null,"G25","E25","6 A/F",{"$f":"IF(INSERIMENTO!G25=\"\",\"\",INSERIMENTO!G25)","v":""},{"$f":"IF(INSERIMENTO!E25=\"\",\"\",INSERIMENTO!E25)","v":""},"",14,{"$f":"COUNTIF($X$2:X54,X54)","v":3},"9999-12-31",26,"9999-12-31",53,"9999-12-31",26,"9999-12-31",53,"9999-12-31","",""]
["RAMDIFE ORVIETO (UFF/MAND: 752) ",null,"Ramdife Orvieto",752,null,null,null,null,null,null,null,null,null,null,null,null,null,null,"G27","E27","7 A/F",{"$f":"IF(INSERIMENTO!G27=\"\",\"\",INSERIMENTO!G27)","v":""},{"$f":"IF(INSERIMENTO!E27=\"\",\"\",INSERIMENTO!E27)","v":""},"",14,{"$f":"COUNTIF($X$2:X55,X55)","v":4},"9999-12-31",26,"9999-12-31",54,"9999-12-31",26,"9999-12-31",54,"9999-12-31","",""]
["RAMDIFE ROMA (UFF/MAND: 19) ",null,"Ramdife Roma",19,null,null,null,null,null,null,null,null,null,null,"1 COM",{"$f":"X56","v":"2009-05-05"},{"$f":"IF(INSERIMENTO!J17>0,INSERIMENTO!J17,\"DIFESA\")","v":"TRANSIZIONE ECOLOGICA"},null,{"$f":"IF(Q56=\"DIFESA\",\"DIF\",VLOOKUP(Q56,'IND. AMM.NE'!$V$4:$AB$26,7,FALSE))","v":"AMB"},null,"1 COM",{"$f":"IF(INSERIMENTO!O17=\"\",\"\",INSERIMENTO!O17)","v":"2013-05-04"},null,{"$f":"IF(INSERIMENTO!M17=\"\",\"\",INSERIMENTO!M17)","v":"2009-05-05"},1,{"$f":"COUNTIF($X$2:X56,X56)","v":1},"2009-05-05",11,"2009-05-05",55,"9999-12-31",26,"9999-12-31",55,"9999-12-31","",""]
["REMADIFE (EX 10^ AUTOGRUPPO) (UFF/MAND: 20) ",null,"Remadife (ex 10^ Autogruppo)",20,null,null,null,null,null,null,null,null,null,null,"POST 1 COM",{"$f":"X62","v":"2013-05-05"},"DIFESA",null,"DIF",null,"2 COM",{"$f":"IF(INSERIMENTO!O19=\"\",\"\",INSERIMENTO!O19)","v":""},null,{"$f":"IF(INSERIMENTO!M19=\"\",\"\",INSERIMENTO!M19)","v":""},14,{"$f":"COUNTIF($X$2:X57,X57)","v":5},"9999-12-31",26,"9999-12-31",56,"9999-12-31",26,"9999-12-31",56,"9999-12-31","",""]
["SEGREDIFESA (UFF/MAND: 16) ",null,"Segredifesa",16,null,null,null,null,null,null,null,null,null,null,"2 COM",{"$f":"X57","v":""},{"$f":"IF(INSERIMENTO!J19>0,INSERIMENTO!J19,\"DIFESA\")","v":"DIFESA"},null,{"$f":"IF(Q58=\"DIFESA\",\"DIF\",VLOOKUP(Q58,'IND. AMM.NE'!$V$4:$AB$26,7,FALSE))","v":"DIF"},null,"3 COM",{"$f":"IF(INSERIMENTO!O21=\"\",\"\",INSERIMENTO!O21)","v":""},null,{"$f":"IF(INSERIMENTO!M21=\"\",\"\",INSERIMENTO!M21)","v":""},14,{"$f":"COUNTIF($X$2:X58,X58)","v":6},"9999-12-31",26,"9999-12-31",57,"9999-12-31",26,"9999-12-31",57,"9999-12-31","",""]
["SMA (STATO MAGGIORE AERONAUTICA) (UFF/MAND: 432) ",null,"SMA (Stato Maggiore Aeronautica)",432,null,null,null,null,null,null,null,null,null,null,"POST 2 COM",{"$f":"X63","v":""},"DIFESA",null,"DIF",null,"4 COM",{"$f":"IF(INSERIMENTO!O23=\"\",\"\",INSERIMENTO!O23)","v":""},null,{"$f":"IF(INSERIMENTO!M23=\"\",\"\",INSERIMENTO!M23)","v":""},14,{"$f":"COUNTIF($X$2:X59,X59)","v":7},"9999-12-31",26,"9999-12-31",58,"9999-12-31",26,"9999-12-31",58,"9999-12-31","",""]
["SMD - DIFEITALIA (UFF/MAND: 745) ",null,"SMD - Difeitalia",745,null,null,null,null,null,null,null,null,null,null,"3 COM",{"$f":"X58","v":""},{"$f":"IF(INSERIMENTO!J21>0,INSERIMENTO!J21,\"DIFESA\")","v":"DIFESA"},null,{"$f":"IF(Q60=\"DIFESA\",\"DIF\",VLOOKUP(Q60,'IND. AMM.NE'!$V$4:$AB$26,7,FALSE))","v":"DIF"},null,"5 COM",{"$f":"IF(INSERIMENTO!O25=\"\",\"\",INSERIMENTO!O25)","v":""},null,{"$f":"IF(INSERIMENTO!M25=\"\",\"\",INSERIMENTO!M25)","v":""},14,{"$f":"COUNTIF($X$2:X60,X60)","v":8},"9999-12-31",26,"9999-12-31",59,"9999-12-31",26,"9999-12-31",59,"9999-12-31","","",null,null," "]
["SMD - RIS (UFF/MAND: 61) ",null,"SMD - RIS",61,null,null,null,null,null,null,null,null,null,null,"POST 3 COM",{"$f":"X64","v":""},"DIFESA",null,"DIF",null,"6 COM",{"$f":"IF(INSERIMENTO!O27=\"\",\"\",INSERIMENTO!O27)","v":""},null,{"$f":"IF(INSERIMENTO!M27=\"\",\"\",INSERIMENTO!M27)","v":""},14,{"$f":"COUNTIF($X$2:X61,X61)","v":9},"9999-12-31",26,"9999-12-31",60,"9999-12-31",26,"9999-12-31",60,"9999-12-31","",""]
["SMD - STATO MAGGIORE DIFESA (UFF/MAND: 741) ",null,"SMD - Stato Maggiore Difesa",741,null,null,null,null,null,null,null,null,null,null,"4 COM",{"$f":"X59","v":""},{"$f":"IF(INSERIMENTO!J23>0,INSERIMENTO!J23,\"DIFESA\")","v":"DIFESA"},null,{"$f":"IF(Q62=\"DIFESA\",\"DIF\",VLOOKUP(Q62,'IND. AMM.NE'!$V$4:$AB$26,7,FALSE))","v":"DIF"},null,"POST 1 COM",null,null,{"$f":"IF(V56=\"\",\"\",V56+1)","v":"2013-05-05"},1,{"$f":"COUNTIF($X$2:X62,X62)","v":1},"2013-05-05",14,"2013-05-05",61,"9999-12-31",26,"9999-12-31",61,"9999-12-31","",""]
["SME (STATO MAGGIORE ESERCITO) + CNA ESERCITO (EX CUSE) (UFF/MAND: 430) ",null,"SME (Stato Maggiore Esercito) + CNA Esercito (ex CUSE)",430,null,null,null,null,null,null,null,null,null,null,"POST 4 COM",{"$f":"X65","v":""},"DIFESA",null,"DIF",null,"POST 2 COM",null,null,{"$f":"IF(V57=\"\",\"\",V57+1)","v":""},14,{"$f":"COUNTIF($X$2:X63,X63)","v":10},"9999-12-31",26,"9999-12-31",62,"9999-12-31",26,"9999-12-31",62,"9999-12-31","",""]
["SMM (STATO MAGGIORE MARINA - EX MARISTAT) (UFF/MAND: 431) ",null,"SMM (Stato Maggiore Marina - ex Maristat)",431,null,null,null,null,null,null,null,null,null,null,"5 COM",{"$f":"X60","v":""},{"$f":"IF(INSERIMENTO!J25>0,INSERIMENTO!J25,\"DIFESA\")","v":"DIFESA"},null,{"$f":"IF(Q64=\"DIFESA\",\"DIF\",VLOOKUP(Q64,'IND. AMM.NE'!$V$4:$AB$26,7,FALSE))","v":"DIF"},null,"POST 3 COM",null,null,"",14,{"$f":"COUNTIF($X$2:X64,X64)","v":11},"9999-12-31",26,"9999-12-31",63,"9999-12-31",26,"9999-12-31",63,"9999-12-31","",""]
["TELEDIFE - SGD (UFF/MAND: 124) ",null,"Teledife - SGD",124,null,null,null,null,null,null,null,null,null,null,"POST 5 COM",{"$f":"X66","v":""},"DIFESA",null,"DIF",null,"POST 4 COM",null,null,"",14,{"$f":"COUNTIF($X$2:X65,X65)","v":12},"9999-12-31",26,"9999-12-31",64,"9999-12-31",26,"9999-12-31",64,"9999-12-31","",""]
["TERRARM (UFF/MAND: 121) ",null,"Terrarm",121,null,null,null,null,null,null,null,null,null,null,"6 COM",{"$f":"X61","v":""},{"$f":"IF(INSERIMENTO!J27>0,INSERIMENTO!J27,\"DIFESA\")","v":"DIFESA"},null,{"$f":"IF(Q66=\"DIFESA\",\"DIF\",VLOOKUP(Q66,'IND. AMM.NE'!$V$4:$AB$26,7,FALSE))","v":"DIF"},null,"POST 5 COM",null,null,"",{"$f":"COUNTIF($X$2:$X$67,X66)","v":14},{"$f":"COUNTIF($X$2:X66,X66)","v":13},{"$f":"IF(X66<$X$49,DATE(9999,12,31),IF(X66>$X$68,DATE(9999,12,31),IF(Z66>1,DATE(9999,12,31),X66)))","v":"9999-12-31"},{"$f":"RANK(AA66,$AA$2:$AA$67,1)","v":26},"9999-12-31",65,{"$f":"IF(ISNA(VLOOKUP(AD66,$AB$2:$AC$67,2,FALSE)),DATE(9999,12,31),VLOOKUP(AD66,$AB$2:$AC$67,2,FALSE))","v":"9999-12-31"},{"$f":"RANK(AE66,$AE$2:$AE$67,1)","v":26},"9999-12-31",65,{"$f":"IF(ISNA(VLOOKUP(AH66,$AF$2:$AG$67,2,FALSE)),DATE(9999,12,31),VLOOKUP(AH66,$AF$2:$AG$67,2,FALSE))","v":"9999-12-31"},"",""]
[{"$f":"CONCATENATE(UPPER(C67),\" (\",$D$1,\": \",D67,\") \")","v":"TRIB. MILIT. SORVEGLIANZA (UFF/MAND: 39) "},null,"Trib. Milit. Sorveglianza",39,null,null,null,null,null,null,null,null,null,null,"POST 6 COM",{"$f":"X67","v":""},"DIFESA",null,"DIF",null,"POST 6 COM",null,null,"",{"$f":"COUNTIF($X$2:$X$67,X67)","v":14},{"$f":"COUNTIF($X$2:X67,X67)","v":14},{"$f":"IF(X67<$X$49,DATE(9999,12,31),IF(X67>$X$68,DATE(9999,12,31),IF(Z67>1,DATE(9999,12,31),X67)))","v":"9999-12-31"},{"$f":"RANK(AA67,$AA$2:$AA$67,1)","v":26},"9999-12-31",66,{"$f":"IF(ISNA(VLOOKUP(AD67,$AB$2:$AC$67,2,FALSE)),DATE(9999,12,31),VLOOKUP(AD67,$AB$2:$AC$67,2,FALSE))","v":"9999-12-31"},{"$f":"RANK(AE67,$AE$2:$AE$67,1)","v":26},"9999-12-31",66,{"$f":"IF(ISNA(VLOOKUP(AH67,$AF$2:$AG$67,2,FALSE)),DATE(9999,12,31),VLOOKUP(AH67,$AF$2:$AG$67,2,FALSE))","v":"9999-12-31"},"",""]
["TRIBUNALE MILITARE DI ROMA (UFF/MAND: 742) ",null,"Tribunale Militare di Roma",742,null,null,null,null,null,null,null,null,null,null,null,null,null,null,null,null,"CESS.",{"$f":"IF(INSERIMENTO!N13=\"\",DATE(9999,12,31),INSERIMENTO!N13)","v":"9999-12-31"},null,{"$f":"V68","v":"9999-12-31"}]
["UAS (UFFICIO AMMINISTRAZIONI SPECIALI) (UFF/MAND: 15) ",null,"UAS (Ufficio Amministrazioni Speciali)",15,null,null,null,null,null,null,null,null,null,null,null,null,null,null," ",null,"MAX",{"$f":"MAX(V49:V61)","v":"2021-01-01"},null,null,null,null,null,null,null,null,null,null,null,"CESS.",{"$f":"IF(V68>0,V68,DATE(9999,12,31))","v":"9999-12-31"}]
["UFAULAV (UFFICIO AUTONOMO LAVORI) (UFF/MAND: 23) ",null,"Ufaulav (Ufficio Autonomo Lavori)",23]
["UTNAV ROMA (EX NAVALGENARMI) (UFF/MAND: 70) ",null,"Utnav Roma (ex Navalgenarmi)",70,null,null,null,null,null,null,null,null,null,null,null,null,null,null," ",null,null,null,null," "]
["UTT - FIRENZE (UFF/MAND: 746) ",null,"UTT - Firenze",746]
["UTT - NAPOLI (UFF/MAND: 747) ",null,"UTT - Napoli",747]
["UTT - NETTUNO (UFF/MAND: 744) ",null,"UTT - Nettuno",744,null,null,null,null,null,null,null,null,null,null,null,null,null,null,null,null,null,null,null,null,null,null," "]
["UTT - TORINO (UFF/MAND: 739) ",null,"UTT - Torino",739]
[" (UFF/MAND: ) "]
[" (UFF/MAND: ) "]
[" (UFF/MAND: ) "]
[" (UFF/MAND: ) "]
[" (UFF/MAND: ) "]
[" (UFF/MAND: ) "]
[" (UFF/MAND: ) "]
[" (UFF/MAND: ) "]